Gene: Caprin2

Name
caprin family member 2
MGI ID
MGI:2448541
Synonyms
RNG140 C1qdc1 Eeg1
Viability
Homozygous - Viable
Other links
Significant phenotypes (0) All measurements (518) Expression & images (45) Disease models (0) Order (3)
View data by physiological system
Significant
Not Significant
Not tested

Filtered by: all phenotypes

Mouseover the data points for more information. Click and drag to zoom the chart. Click on the legends to disable/enable data.

Allele Center Procedure / Parameter Zygosity Mutants Statistical
Method
P Value Status
Caprin2tm2a(EUCOMM)Wtsi WTSI Hot Plate / Time of first response HOM 7f:7m Mixed Model framework, linear mixed-effects model, equation withoutWeight 0.871 Success
Caprin2tm2a(EUCOMM)Wtsi WTSI Hot Plate / Time of first response HOM 7f:7m Mixed Model framework, linear mixed-effects model, equation withoutWeight 0.871 Success
Caprin2tm2a(EUCOMM)Wtsi WTSI Hot Plate / Time of first response HOM 1f:0m Not processed 1.00 FAILED - Not enough mutant or control data
Caprin2tm2a(EUCOMM)Wtsi WTSI Hot Plate / Time of first response HOM 1f:0m Not processed 1.00 FAILED - Not enough mutant or control data
Caprin2tm2a(EUCOMM)Wtsi WTSI Hot Plate / Body Weight HOM 7f:7m Mixed Model framework, linear mixed-effects model, equation withoutWeight 0.0556 Success
Caprin2tm2a(EUCOMM)Wtsi WTSI Hot Plate / Body Weight HOM 7f:7m Mixed Model framework, linear mixed-effects model, equation withoutWeight 0.0556 Success
Caprin2tm2a(EUCOMM)Wtsi WTSI Hot Plate / Body Weight HOM 1f:0m Not processed 1.00 FAILED - Not enough mutant or control data
Caprin2tm2a(EUCOMM)Wtsi WTSI Hot Plate / Body Weight HOM 1f:0m Not processed 1.00 FAILED - Not enough mutant or control data
Caprin2tm2a(EUCOMM)Wtsi WTSI Dysmorphology / Eye colouration HOM 7f:7m Fisher Exact Test framework 1.00 Success
Caprin2tm2a(EUCOMM)Wtsi WTSI Dysmorphology / Eye colouration HOM 7f:7m Fisher Exact Test framework 1.00 Success
Caprin2tm2a(EUCOMM)Wtsi WTSI Dysmorphology / Eye colouration HOM 1f:0m - 1.00 FAILED - Not enough mutant or control data
Caprin2tm2a(EUCOMM)Wtsi WTSI Dysmorphology / Eye colouration HOM 1f:0m - 1.00 FAILED - Not enough mutant or control data
Caprin2tm2a(EUCOMM)Wtsi WTSI Buffy coat peripheral blood leukocyte immunophenotyping / NKT cell percentage HOM 7f:7m Mixed Model framework, linear mixed-effects model, equation withoutWeight 0.976 Success
Caprin2tm2a(EUCOMM)Wtsi WTSI Dysmorphology / Eye size HOM 1f:0m - 1.00 FAILED - Not enough mutant or control data
Caprin2tm2a(EUCOMM)Wtsi WTSI Dysmorphology / Eye size HOM 7f:7m Fisher Exact Test framework 1.00 Success
Caprin2tm2a(EUCOMM)Wtsi WTSI Dysmorphology / Eye size HOM 1f:0m - 1.00 FAILED - Not enough mutant or control data
Caprin2tm2a(EUCOMM)Wtsi WTSI Dysmorphology / Eye size HOM 7f:7m Fisher Exact Test framework 1.00 Success
Caprin2tm2a(EUCOMM)Wtsi WTSI Dysmorphology / Eyes HOM 1f:0m - 1.00 FAILED - Not enough mutant or control data
Caprin2tm2a(EUCOMM)Wtsi WTSI Dysmorphology / Eyes HOM 1f:0m - 1.00 FAILED - Not enough mutant or control data
Caprin2tm2a(EUCOMM)Wtsi WTSI Dysmorphology / Eyes HOM 7f:7m Fisher Exact Test framework 1.00 Success
Caprin2tm2a(EUCOMM)Wtsi WTSI Dysmorphology / Eyes HOM 7f:7m Fisher Exact Test framework 1.00 Success
Caprin2tm2a(EUCOMM)Wtsi WTSI Haematology test / Haemoglobin HOM 7f:7m Mixed Model framework, linear mixed-effects model, equation withoutWeight 0.00700 Success
Caprin2tm2a(EUCOMM)Wtsi WTSI Haematology test / Haemoglobin HOM 7f:7m Mixed Model framework, linear mixed-effects model, equation withoutWeight 0.00700 Success
Caprin2tm2a(EUCOMM)Wtsi WTSI Haematology test / Haematocrit HOM 7f:7m Mixed Model framework, linear mixed-effects model, equation withoutWeight 0.483 Success
Caprin2tm2a(EUCOMM)Wtsi WTSI Haematology test / Haematocrit HOM 7f:7m Mixed Model framework, linear mixed-effects model, equation withoutWeight 0.483 Success
Caprin2tm2a(EUCOMM)Wtsi WTSI Haematology test / White blood cell-count HOM 7f:7m Mixed Model framework, linear mixed-effects model, equation withoutWeight 0.0180 Success
Caprin2tm2a(EUCOMM)Wtsi WTSI Haematology test / White blood cell-count HOM 7f:7m Mixed Model framework, linear mixed-effects model, equation withoutWeight 0.0180 Success
Caprin2tm2a(EUCOMM)Wtsi WTSI Haematology test / Red Blood Cell-count HOM 7f:7m Mixed Model framework, linear mixed-effects model, equation withoutWeight 0.238 Success
Caprin2tm2a(EUCOMM)Wtsi WTSI Haematology test / Red Blood Cell-count HOM 7f:7m Mixed Model framework, linear mixed-effects model, equation withoutWeight 0.238 Success
Caprin2tm2a(EUCOMM)Wtsi WTSI Haematology test / Mean-cell-haemoglobin-conc HOM 7f:7m Mixed Model framework, linear mixed-effects model, equation withoutWeight 1.54×10-07 Success
Caprin2tm2a(EUCOMM)Wtsi WTSI Haematology test / Mean-cell-haemoglobin-conc HOM 7f:7m Mixed Model framework, linear mixed-effects model, equation withoutWeight 1.54×10-07 Success
Caprin2tm2a(EUCOMM)Wtsi WTSI Dysmorphology / Incisor HOM 7f:7m Fisher Exact Test framework 1.00 Success
Caprin2tm2a(EUCOMM)Wtsi WTSI Dysmorphology / Incisor HOM 1f:0m - 1.00 FAILED - Not enough mutant or control data
Caprin2tm2a(EUCOMM)Wtsi WTSI Dysmorphology / Incisor HOM 7f:7m Fisher Exact Test framework 1.00 Success
Caprin2tm2a(EUCOMM)Wtsi WTSI Dysmorphology / Incisor HOM 1f:0m - 1.00 FAILED - Not enough mutant or control data
Caprin2tm2a(EUCOMM)Wtsi WTSI Indirect Calorimetry / Body mass after experiment HOM 2f:7m Not processed 1.00 FAILED - Not enough data points in dependent variable 'M.G.P_003_001_002' for genotype/sex combinations to allow the application of MM/TF framework. Threshold used: 4.
Caprin2tm2a(EUCOMM)Wtsi WTSI Indirect Calorimetry / Body mass after experiment HOM 2f:7m Not processed 1.00 FAILED - Not enough data points in dependent variable 'M.G.P_003_001_002' for genotype/sex combinations to allow the application of MM/TF framework. Threshold used: 4.
Caprin2tm2a(EUCOMM)Wtsi WTSI Haematology test / Platelets-count HOM 7f:7m Mixed Model framework, linear mixed-effects model, equation withoutWeight 0.614 Success
Caprin2tm2a(EUCOMM)Wtsi WTSI Haematology test / Platelets-count HOM 7f:7m Mixed Model framework, linear mixed-effects model, equation withoutWeight 0.614 Success
Caprin2tm2a(EUCOMM)Wtsi WTSI Dysmorphology / Snout morphology HOM 1f:0m - 1.00 FAILED - Not enough mutant or control data
Caprin2tm2a(EUCOMM)Wtsi WTSI Dysmorphology / Snout morphology HOM 1f:0m - 1.00 FAILED - Not enough mutant or control data
Caprin2tm2a(EUCOMM)Wtsi WTSI Dysmorphology / Snout morphology HOM 7f:7m Fisher Exact Test framework 1.00 Success
Caprin2tm2a(EUCOMM)Wtsi WTSI Dysmorphology / Snout morphology HOM 7f:7m Fisher Exact Test framework 1.00 Success
Caprin2tm2a(EUCOMM)Wtsi WTSI Indirect Calorimetry / Body mass before experiment HOM 2f:7m Not processed 1.00 FAILED - Not enough data points in dependent variable 'M.G.P_003_001_001' for genotype/sex combinations to allow the application of MM/TF framework. Threshold used: 4.
Caprin2tm2a(EUCOMM)Wtsi WTSI Indirect Calorimetry / Body mass before experiment HOM 2f:7m Not processed 1.00 FAILED - Not enough data points in dependent variable 'M.G.P_003_001_001' for genotype/sex combinations to allow the application of MM/TF framework. Threshold used: 4.
Caprin2tm2a(EUCOMM)Wtsi WTSI Haematology test / Mean-cell-volume HOM 7f:7m Mixed Model framework, linear mixed-effects model, equation withoutWeight 0.0714 Success
Caprin2tm2a(EUCOMM)Wtsi WTSI Haematology test / Mean-cell-volume HOM 7f:7m Mixed Model framework, linear mixed-effects model, equation withoutWeight 0.0714 Success
Caprin2tm2a(EUCOMM)Wtsi WTSI Dysmorphology / Mouth morphology HOM 1f:0m - 1.00 FAILED - Not enough mutant or control data
Caprin2tm2a(EUCOMM)Wtsi WTSI Dysmorphology / Mouth morphology HOM 7f:7m Fisher Exact Test framework 1.00 Not tested (No variation) - OK
Caprin2tm2a(EUCOMM)Wtsi WTSI Dysmorphology / Mouth morphology HOM 1f:0m - 1.00 FAILED - Not enough mutant or control data
Caprin2tm2a(EUCOMM)Wtsi WTSI Dysmorphology / Mouth morphology HOM 7f:7m Fisher Exact Test framework 1.00 Not tested (No variation) - OK
Caprin2tm2a(EUCOMM)Wtsi WTSI Haematology test / Mean-corpuscular-haemoglobin HOM 7f:7m Mixed Model framework, linear mixed-effects model, equation withoutWeight 0.000828 Success
Caprin2tm2a(EUCOMM)Wtsi WTSI Haematology test / Mean-corpuscular-haemoglobin HOM 7f:7m Mixed Model framework, linear mixed-effects model, equation withoutWeight 0.000828 Success
Caprin2tm2a(EUCOMM)Wtsi WTSI Dysmorphology / Ear size HOM 7f:7m Fisher Exact Test framework 1.00 Not tested (No variation) - OK
Caprin2tm2a(EUCOMM)Wtsi WTSI Dysmorphology / Ear size HOM 1f:0m - 1.00 FAILED - Not enough mutant or control data
Caprin2tm2a(EUCOMM)Wtsi WTSI Dysmorphology / Ear size HOM 1f:0m - 1.00 FAILED - Not enough mutant or control data
Caprin2tm2a(EUCOMM)Wtsi WTSI Dysmorphology / Ear size HOM 7f:7m Fisher Exact Test framework 1.00 Not tested (No variation) - OK
Caprin2tm2a(EUCOMM)Wtsi WTSI Dysmorphology / Ear morphology HOM 1f:0m - 1.00 FAILED - Not enough mutant or control data
Caprin2tm2a(EUCOMM)Wtsi WTSI Dysmorphology / Ear morphology HOM 1f:0m - 1.00 FAILED - Not enough mutant or control data
Caprin2tm2a(EUCOMM)Wtsi WTSI Dysmorphology / Ear morphology HOM 7f:7m Fisher Exact Test framework 1.00 Not tested (No variation) - OK
Caprin2tm2a(EUCOMM)Wtsi WTSI Dysmorphology / Ear morphology HOM 7f:7m Fisher Exact Test framework 1.00 Not tested (No variation) - OK
Caprin2tm2a(EUCOMM)Wtsi WTSI Dysmorphology / Whiskers HOM 7f:7m Fisher Exact Test framework 0.615 Success
Caprin2tm2a(EUCOMM)Wtsi WTSI Dysmorphology / Whiskers HOM 7f:7m Fisher Exact Test framework 0.615 Success
Caprin2tm2a(EUCOMM)Wtsi WTSI Dysmorphology / Whiskers HOM 1f:0m - 1.00 FAILED - Not enough mutant or control data
Caprin2tm2a(EUCOMM)Wtsi WTSI Dysmorphology / Whiskers HOM 1f:0m - 1.00 FAILED - Not enough mutant or control data
Caprin2tm2a(EUCOMM)Wtsi WTSI Dysmorphology / Incisor colour HOM 7f:7m Fisher Exact Test framework 1.00 Not tested (No variation) - OK
Caprin2tm2a(EUCOMM)Wtsi WTSI Dysmorphology / Incisor colour HOM 1f:0m - 1.00 FAILED - Not enough mutant or control data
Caprin2tm2a(EUCOMM)Wtsi WTSI Dysmorphology / Incisor colour HOM 1f:0m - 1.00 FAILED - Not enough mutant or control data
Caprin2tm2a(EUCOMM)Wtsi WTSI Dysmorphology / Incisor colour HOM 7f:7m Fisher Exact Test framework 1.00 Not tested (No variation) - OK
Caprin2tm2a(EUCOMM)Wtsi WTSI X-ray / Shape of femur HOM 7f:7m Fisher Exact Test framework 0.105 Success
Caprin2tm2a(EUCOMM)Wtsi WTSI X-ray / Shape of femur HOM 7f:7m Fisher Exact Test framework 0.105 Success
Caprin2tm2a(EUCOMM)Wtsi WTSI X-ray / Number of digits HOM 7f:7m Not processed 1.00 FAILED - No variability in dependent variable 'M.G.P_006_001_004'.
Caprin2tm2a(EUCOMM)Wtsi WTSI X-ray / Number of digits HOM 7f:7m Not processed 1.00 FAILED - No variability in dependent variable 'M.G.P_006_001_004'.
Caprin2tm2a(EUCOMM)Wtsi WTSI X-ray / Shape of humerus HOM 7f:7m Fisher Exact Test framework 1.00 Not tested (No variation) - OK
Caprin2tm2a(EUCOMM)Wtsi WTSI X-ray / Shape of humerus HOM 7f:7m Fisher Exact Test framework 1.00 Not tested (No variation) - OK
Caprin2tm2a(EUCOMM)Wtsi WTSI X-ray / Fibula HOM 7f:7m Fisher Exact Test framework 1.00 Not tested (No variation) - OK
Caprin2tm2a(EUCOMM)Wtsi WTSI X-ray / Fibula HOM 7f:7m Fisher Exact Test framework 1.00 Not tested (No variation) - OK
Caprin2tm2a(EUCOMM)Wtsi WTSI Dysmorphology / Genitalia size HOM 1f:0m - 1.00 FAILED - Not enough mutant or control data
Caprin2tm2a(EUCOMM)Wtsi WTSI Dysmorphology / Genitalia size HOM 1f:0m - 1.00 FAILED - Not enough mutant or control data
Caprin2tm2a(EUCOMM)Wtsi WTSI Dysmorphology / Genitalia size HOM 7f:7m Fisher Exact Test framework 1.00 Not tested (No variation) - OK
Caprin2tm2a(EUCOMM)Wtsi WTSI Dysmorphology / Genitalia size HOM 7f:7m Fisher Exact Test framework 1.00 Not tested (No variation) - OK
Caprin2tm2a(EUCOMM)Wtsi WTSI X-ray / Mandibles HOM 7f:7m Fisher Exact Test framework 1.00 Not tested (No variation) - OK
Caprin2tm2a(EUCOMM)Wtsi WTSI X-ray / Mandibles HOM 7f:7m Fisher Exact Test framework 1.00 Not tested (No variation) - OK
Caprin2tm2a(EUCOMM)Wtsi WTSI X-ray / Joints HOM 7f:7m Fisher Exact Test framework 0.0244 Success
Caprin2tm2a(EUCOMM)Wtsi WTSI X-ray / Joints HOM 7f:7m Fisher Exact Test framework 0.0244 Success
Caprin2tm2a(EUCOMM)Wtsi WTSI Antigen Specific Immunoglobulin Assay / TetC specific IgG1 HOM 0f:3m Not processed 1.00 FAILED - Not enough mutant or control data
Caprin2tm2a(EUCOMM)Wtsi WTSI X-ray / Clavicle HOM 7f:7m Fisher Exact Test framework 1.00 Not tested (No variation) - OK
Caprin2tm2a(EUCOMM)Wtsi WTSI X-ray / Clavicle HOM 7f:7m Fisher Exact Test framework 1.00 Not tested (No variation) - OK
Caprin2tm2a(EUCOMM)Wtsi WTSI X-ray / Digit integrity HOM 7f:7m Fisher Exact Test framework 0.323 Success
Caprin2tm2a(EUCOMM)Wtsi WTSI X-ray / Digit integrity HOM 7f:7m Fisher Exact Test framework 0.323 Success
Caprin2tm2a(EUCOMM)Wtsi WTSI X-ray / Completeness of digits HOM 7f:7m Fisher Exact Test framework 1.00 Success
Caprin2tm2a(EUCOMM)Wtsi WTSI X-ray / Completeness of digits HOM 7f:7m Fisher Exact Test framework 1.00 Success
Caprin2tm2a(EUCOMM)Wtsi WTSI Clinical Chemistry / Chloride HOM 7f:6m Mixed Model framework, linear mixed-effects model, equation withoutWeight 0.517 Success
Caprin2tm2a(EUCOMM)Wtsi WTSI Clinical Chemistry / Chloride HOM 7f:6m Mixed Model framework, linear mixed-effects model, equation withoutWeight 0.517 Success
Caprin2tm2a(EUCOMM)Wtsi WTSI Clinical Chemistry / Chloride HOM 0f:1m Not processed 1.00 FAILED - Not enough mutant or control data
Caprin2tm2a(EUCOMM)Wtsi WTSI Clinical Chemistry / Chloride HOM 0f:1m Not processed 1.00 FAILED - Not enough mutant or control data
Caprin2tm2a(EUCOMM)Wtsi WTSI Clinical Chemistry / Potassium HOM 7f:6m Mixed Model framework, linear mixed-effects model, equation withoutWeight 0.166 Success
Caprin2tm2a(EUCOMM)Wtsi WTSI Clinical Chemistry / Potassium HOM 7f:6m Mixed Model framework, linear mixed-effects model, equation withoutWeight 0.166 Success
Caprin2tm2a(EUCOMM)Wtsi WTSI Clinical Chemistry / Potassium HOM 0f:1m Not processed 1.00 FAILED - Not enough mutant or control data
Caprin2tm2a(EUCOMM)Wtsi WTSI Clinical Chemistry / Potassium HOM 0f:1m Not processed 1.00 FAILED - Not enough mutant or control data
Caprin2tm2a(EUCOMM)Wtsi WTSI Clinical Chemistry / Sodium HOM 7f:6m Mixed Model framework, linear mixed-effects model, equation withoutWeight 0.00309 Success
Caprin2tm2a(EUCOMM)Wtsi WTSI Clinical Chemistry / Sodium HOM 7f:6m Mixed Model framework, linear mixed-effects model, equation withoutWeight 0.00309 Success
Caprin2tm2a(EUCOMM)Wtsi WTSI Clinical Chemistry / Sodium HOM 0f:1m Not processed 1.00 FAILED - Not enough mutant or control data
Caprin2tm2a(EUCOMM)Wtsi WTSI Clinical Chemistry / Sodium HOM 0f:1m Not processed 1.00 FAILED - Not enough mutant or control data
Caprin2tm2a(EUCOMM)Wtsi WTSI Dysmorphology / Genitalia morphology HOM 7f:7m Fisher Exact Test framework 1.00 Success
Caprin2tm2a(EUCOMM)Wtsi WTSI Dysmorphology / Genitalia morphology HOM 1f:0m - 1.00 FAILED - Not enough mutant or control data
Caprin2tm2a(EUCOMM)Wtsi WTSI Dysmorphology / Genitalia morphology HOM 1f:0m - 1.00 FAILED - Not enough mutant or control data
Caprin2tm2a(EUCOMM)Wtsi WTSI Dysmorphology / Genitalia morphology HOM 7f:7m Fisher Exact Test framework 1.00 Success
Caprin2tm2a(EUCOMM)Wtsi WTSI Clinical Chemistry / Creatinine HOM 7f:6m Mixed Model framework, linear mixed-effects model, equation withoutWeight 0.570 Success
Caprin2tm2a(EUCOMM)Wtsi WTSI Clinical Chemistry / Creatinine HOM 7f:6m Mixed Model framework, linear mixed-effects model, equation withoutWeight 0.570 Success
Caprin2tm2a(EUCOMM)Wtsi WTSI Clinical Chemistry / Creatinine HOM 0f:1m Not processed 1.00 FAILED - Not enough mutant or control data
Caprin2tm2a(EUCOMM)Wtsi WTSI Clinical Chemistry / Creatinine HOM 0f:1m Not processed 1.00 FAILED - Not enough mutant or control data
Caprin2tm2a(EUCOMM)Wtsi WTSI Dysmorphology / Genitalia HOM 7f:7m Fisher Exact Test framework 1.00 Not tested (No variation) - OK
Caprin2tm2a(EUCOMM)Wtsi WTSI Dysmorphology / Genitalia HOM 1f:0m - 1.00 FAILED - Not enough mutant or control data
Caprin2tm2a(EUCOMM)Wtsi WTSI Dysmorphology / Genitalia HOM 7f:7m Fisher Exact Test framework 1.00 Not tested (No variation) - OK
Caprin2tm2a(EUCOMM)Wtsi WTSI Dysmorphology / Genitalia HOM 1f:0m - 1.00 FAILED - Not enough mutant or control data
Caprin2tm2a(EUCOMM)Wtsi WTSI Buffy coat peripheral blood leukocyte immunophenotyping / Monocyte percentage HOM 7f:7m Mixed Model framework, linear mixed-effects model, equation withoutWeight 0.0889 Success
Caprin2tm2a(EUCOMM)Wtsi WTSI Clinical Chemistry / Urea HOM 7f:6m Mixed Model framework, linear mixed-effects model, equation withoutWeight 0.209 Success
Caprin2tm2a(EUCOMM)Wtsi WTSI Clinical Chemistry / Urea HOM 7f:6m Mixed Model framework, linear mixed-effects model, equation withoutWeight 0.209 Success
Caprin2tm2a(EUCOMM)Wtsi WTSI Clinical Chemistry / Urea HOM 0f:1m Not processed 1.00 FAILED - Not enough mutant or control data
Caprin2tm2a(EUCOMM)Wtsi WTSI Clinical Chemistry / Urea HOM 0f:1m Not processed 1.00 FAILED - Not enough mutant or control data
Caprin2tm2a(EUCOMM)Wtsi WTSI Clinical Chemistry / Glucose HOM 7f:6m Mixed Model framework, linear mixed-effects model, equation withoutWeight 0.269 Success
Caprin2tm2a(EUCOMM)Wtsi WTSI Clinical Chemistry / Glucose HOM 7f:6m Mixed Model framework, linear mixed-effects model, equation withoutWeight 0.269 Success
Caprin2tm2a(EUCOMM)Wtsi WTSI Clinical Chemistry / Glucose HOM 0f:1m Not processed 1.00 FAILED - Not enough mutant or control data
Caprin2tm2a(EUCOMM)Wtsi WTSI Clinical Chemistry / Glucose HOM 0f:1m Not processed 1.00 FAILED - Not enough mutant or control data
Caprin2tm2a(EUCOMM)Wtsi WTSI Dysmorphology / Forepaw nails HOM 7f:7m Fisher Exact Test framework 1.00 Not tested (No variation) - OK
Caprin2tm2a(EUCOMM)Wtsi WTSI Dysmorphology / Forepaw nails HOM 1f:0m - 1.00 FAILED - Not enough mutant or control data
Caprin2tm2a(EUCOMM)Wtsi WTSI Dysmorphology / Forepaw nails HOM 7f:7m Fisher Exact Test framework 1.00 Not tested (No variation) - OK
Caprin2tm2a(EUCOMM)Wtsi WTSI Dysmorphology / Forepaw nails HOM 1f:0m - 1.00 FAILED - Not enough mutant or control data
Caprin2tm2a(EUCOMM)Wtsi WTSI Dysmorphology / Forepaw Foot pads HOM 1f:0m - 1.00 FAILED - Not enough mutant or control data
Caprin2tm2a(EUCOMM)Wtsi WTSI Dysmorphology / Forepaw Foot pads HOM 1f:0m - 1.00 FAILED - Not enough mutant or control data
Caprin2tm2a(EUCOMM)Wtsi WTSI Dysmorphology / Forepaw Foot pads HOM 7f:7m Fisher Exact Test framework 1.00 Not tested (No variation) - OK
Caprin2tm2a(EUCOMM)Wtsi WTSI Dysmorphology / Forepaw Foot pads HOM 7f:7m Fisher Exact Test framework 1.00 Not tested (No variation) - OK
Caprin2tm2a(EUCOMM)Wtsi WTSI Dysmorphology / Forepaw size HOM 7f:7m Fisher Exact Test framework 1.00 Not tested (No variation) - OK
Caprin2tm2a(EUCOMM)Wtsi WTSI Dysmorphology / Forepaw size HOM 1f:0m - 1.00 FAILED - Not enough mutant or control data
Caprin2tm2a(EUCOMM)Wtsi WTSI Dysmorphology / Forepaw size HOM 1f:0m - 1.00 FAILED - Not enough mutant or control data
Caprin2tm2a(EUCOMM)Wtsi WTSI Dysmorphology / Forepaw size HOM 7f:7m Fisher Exact Test framework 1.00 Not tested (No variation) - OK
Caprin2tm2a(EUCOMM)Wtsi WTSI Dysmorphology / Forelimb size HOM 7f:7m Fisher Exact Test framework 1.00 Not tested (No variation) - OK
Caprin2tm2a(EUCOMM)Wtsi WTSI Dysmorphology / Forelimb size HOM 1f:0m - 1.00 FAILED - Not enough mutant or control data
Caprin2tm2a(EUCOMM)Wtsi WTSI Dysmorphology / Forelimb size HOM 1f:0m - 1.00 FAILED - Not enough mutant or control data
Caprin2tm2a(EUCOMM)Wtsi WTSI Dysmorphology / Forelimb size HOM 7f:7m Fisher Exact Test framework 1.00 Not tested (No variation) - OK
Caprin2tm2a(EUCOMM)Wtsi WTSI Dysmorphology / Hindlimb nails HOM 7f:7m Fisher Exact Test framework 0.478 Success
Caprin2tm2a(EUCOMM)Wtsi WTSI Dysmorphology / Hindlimb nails HOM 7f:7m Fisher Exact Test framework 0.478 Success
Caprin2tm2a(EUCOMM)Wtsi WTSI Dysmorphology / Hindlimb nails HOM 1f:0m - 1.00 FAILED - Not enough mutant or control data
Caprin2tm2a(EUCOMM)Wtsi WTSI Dysmorphology / Hindlimb nails HOM 1f:0m - 1.00 FAILED - Not enough mutant or control data
Caprin2tm2a(EUCOMM)Wtsi WTSI Clinical Chemistry / Calcium HOM 7f:6m Mixed Model framework, linear mixed-effects model, equation withoutWeight 0.0601 Success
Caprin2tm2a(EUCOMM)Wtsi WTSI Clinical Chemistry / Calcium HOM 7f:6m Mixed Model framework, linear mixed-effects model, equation withoutWeight 0.0601 Success
Caprin2tm2a(EUCOMM)Wtsi WTSI Clinical Chemistry / Calcium HOM 0f:1m Not processed 1.00 FAILED - Not enough mutant or control data
Caprin2tm2a(EUCOMM)Wtsi WTSI Clinical Chemistry / Calcium HOM 0f:1m Not processed 1.00 FAILED - Not enough mutant or control data
Caprin2tm2a(EUCOMM)Wtsi WTSI Buffy coat peripheral blood leukocyte immunophenotyping / CD8+CD44+CD62L- percentage HOM 7f:7m Mixed Model framework, linear mixed-effects model, equation withoutWeight 0.156 Success
Caprin2tm2a(EUCOMM)Wtsi WTSI Dysmorphology / Hindlimb foot pads HOM 7f:7m Fisher Exact Test framework 1.00 Success
Caprin2tm2a(EUCOMM)Wtsi WTSI Dysmorphology / Hindlimb foot pads HOM 1f:0m - 1.00 FAILED - Not enough mutant or control data
Caprin2tm2a(EUCOMM)Wtsi WTSI Dysmorphology / Hindlimb foot pads HOM 1f:0m - 1.00 FAILED - Not enough mutant or control data
Caprin2tm2a(EUCOMM)Wtsi WTSI Dysmorphology / Hindlimb foot pads HOM 7f:7m Fisher Exact Test framework 1.00 Success
Caprin2tm2a(EUCOMM)Wtsi WTSI Clinical Chemistry / Albumin HOM 7f:6m Mixed Model framework, linear mixed-effects model, equation withoutWeight 0.584 Success
Caprin2tm2a(EUCOMM)Wtsi WTSI Clinical Chemistry / Albumin HOM 7f:6m Mixed Model framework, linear mixed-effects model, equation withoutWeight 0.584 Success
Caprin2tm2a(EUCOMM)Wtsi WTSI Clinical Chemistry / Albumin HOM 0f:1m Not processed 1.00 FAILED - Not enough mutant or control data
Caprin2tm2a(EUCOMM)Wtsi WTSI Clinical Chemistry / Albumin HOM 0f:1m Not processed 1.00 FAILED - Not enough mutant or control data
Caprin2tm2a(EUCOMM)Wtsi WTSI Dysmorphology / Hind paw size HOM 1f:0m - 1.00 FAILED - Not enough mutant or control data
Caprin2tm2a(EUCOMM)Wtsi WTSI Dysmorphology / Hind paw size HOM 7f:7m Fisher Exact Test framework 1.00 Success
Caprin2tm2a(EUCOMM)Wtsi WTSI Dysmorphology / Hind paw size HOM 1f:0m - 1.00 FAILED - Not enough mutant or control data
Caprin2tm2a(EUCOMM)Wtsi WTSI Dysmorphology / Hind paw size HOM 7f:7m Fisher Exact Test framework 1.00 Success
Caprin2tm2a(EUCOMM)Wtsi WTSI Clinical Chemistry / Total protein HOM 7f:6m Mixed Model framework, linear mixed-effects model, equation withoutWeight 0.0562 Success
Caprin2tm2a(EUCOMM)Wtsi WTSI Clinical Chemistry / Total protein HOM 7f:6m Mixed Model framework, linear mixed-effects model, equation withoutWeight 0.0562 Success
Caprin2tm2a(EUCOMM)Wtsi WTSI Clinical Chemistry / Total protein HOM 0f:1m Not processed 1.00 FAILED - Not enough mutant or control data
Caprin2tm2a(EUCOMM)Wtsi WTSI Clinical Chemistry / Total protein HOM 0f:1m Not processed 1.00 FAILED - Not enough mutant or control data
Caprin2tm2a(EUCOMM)Wtsi WTSI Dysmorphology / Hindlimb size HOM 7f:7m Fisher Exact Test framework 1.00 Not tested (No variation) - OK
Caprin2tm2a(EUCOMM)Wtsi WTSI Dysmorphology / Hindlimb size HOM 1f:0m - 1.00 FAILED - Not enough mutant or control data
Caprin2tm2a(EUCOMM)Wtsi WTSI Dysmorphology / Hindlimb size HOM 7f:7m Fisher Exact Test framework 1.00 Not tested (No variation) - OK
Caprin2tm2a(EUCOMM)Wtsi WTSI Dysmorphology / Hindlimb size HOM 1f:0m - 1.00 FAILED - Not enough mutant or control data
Caprin2tm2a(EUCOMM)Wtsi WTSI X-ray / Number of ribs right HOM 7f:7m Not processed 1.00 FAILED - testDataset returned an error, check log file
Caprin2tm2a(EUCOMM)Wtsi WTSI X-ray / Number of ribs right HOM 7f:7m Not processed 1.00 FAILED - testDataset returned an error, check log file
Caprin2tm2a(EUCOMM)Wtsi WTSI X-ray / Number of ribs left HOM 7f:7m Not processed 1.00 FAILED - No variability in dependent variable 'M.G.P_006_001_015'.
Caprin2tm2a(EUCOMM)Wtsi WTSI X-ray / Number of ribs left HOM 7f:7m Not processed 1.00 FAILED - No variability in dependent variable 'M.G.P_006_001_015'.
Caprin2tm2a(EUCOMM)Wtsi WTSI X-ray / Scapulae HOM 7f:7m Fisher Exact Test framework 1.00 Not tested (No variation) - OK
Caprin2tm2a(EUCOMM)Wtsi WTSI X-ray / Scapulae HOM 7f:7m Fisher Exact Test framework 1.00 Not tested (No variation) - OK
Caprin2tm2a(EUCOMM)Wtsi WTSI X-ray / Shape of ribs HOM 7f:7m Fisher Exact Test framework 1.00 Not tested (No variation) - OK
Caprin2tm2a(EUCOMM)Wtsi WTSI X-ray / Shape of ribs HOM 7f:7m Fisher Exact Test framework 1.00 Not tested (No variation) - OK
Caprin2tm2a(EUCOMM)Wtsi WTSI X-ray / Skull shape HOM 7f:7m Fisher Exact Test framework 1.00 Success
Caprin2tm2a(EUCOMM)Wtsi WTSI X-ray / Skull shape HOM 7f:7m Fisher Exact Test framework 1.00 Success
Caprin2tm2a(EUCOMM)Wtsi WTSI X-ray / Maxilla HOM 7f:7m Fisher Exact Test framework 1.00 Success
Caprin2tm2a(EUCOMM)Wtsi WTSI X-ray / Maxilla HOM 7f:7m Fisher Exact Test framework 1.00 Success
Caprin2tm2a(EUCOMM)Wtsi WTSI X-ray / Pelvis HOM 7f:7m Fisher Exact Test framework 0.461 Success
Caprin2tm2a(EUCOMM)Wtsi WTSI X-ray / Pelvis HOM 7f:7m Fisher Exact Test framework 0.461 Success
Caprin2tm2a(EUCOMM)Wtsi WTSI X-ray / Orbit HOM 7f:7m Fisher Exact Test framework 1.00 Not tested (No variation) - OK
Caprin2tm2a(EUCOMM)Wtsi WTSI X-ray / Orbit HOM 7f:7m Fisher Exact Test framework 1.00 Not tested (No variation) - OK
Caprin2tm2a(EUCOMM)Wtsi WTSI Buffy coat peripheral blood leukocyte immunophenotyping / B cell CD19+ percentage HOM 7f:7m Mixed Model framework, linear mixed-effects model, equation withoutWeight 0.00499 Success
Caprin2tm2a(EUCOMM)Wtsi WTSI X-ray / Rib HOM 7f:7m Fisher Exact Test framework 1.00 Not tested (No variation) - OK
Caprin2tm2a(EUCOMM)Wtsi WTSI X-ray / Rib HOM 7f:7m Fisher Exact Test framework 1.00 Not tested (No variation) - OK
Caprin2tm2a(EUCOMM)Wtsi WTSI X-ray / Radius HOM 7f:7m Fisher Exact Test framework 1.00 Success
Caprin2tm2a(EUCOMM)Wtsi WTSI X-ray / Radius HOM 7f:7m Fisher Exact Test framework 1.00 Success
Caprin2tm2a(EUCOMM)Wtsi WTSI Antigen Specific Immunoglobulin Assay / TetC specific total IgG HOM 0f:3m Not processed 1.00 FAILED - Not enough mutant or control data
Caprin2tm2a(EUCOMM)Wtsi WTSI Buffy coat peripheral blood leukocyte immunophenotyping / Mature B cell IgD+ percentage HOM 7f:7m Mixed Model framework, linear mixed-effects model, equation withoutWeight 0.250 Success
Caprin2tm2a(EUCOMM)Wtsi WTSI Dysmorphology / Tail morphology HOM 7f:7m Fisher Exact Test framework 1.00 Success
Caprin2tm2a(EUCOMM)Wtsi WTSI Dysmorphology / Tail morphology HOM 1f:0m - 1.00 FAILED - Not enough mutant or control data
Caprin2tm2a(EUCOMM)Wtsi WTSI Dysmorphology / Tail morphology HOM 1f:0m - 1.00 FAILED - Not enough mutant or control data
Caprin2tm2a(EUCOMM)Wtsi WTSI Dysmorphology / Tail morphology HOM 7f:7m Fisher Exact Test framework 1.00 Success
Caprin2tm2a(EUCOMM)Wtsi WTSI Dysmorphology / Tail length HOM 1f:0m - 1.00 FAILED - Not enough mutant or control data
Caprin2tm2a(EUCOMM)Wtsi WTSI Dysmorphology / Tail length HOM 7f:7m Fisher Exact Test framework 1.00 Success
Caprin2tm2a(EUCOMM)Wtsi WTSI Dysmorphology / Tail length HOM 1f:0m - 1.00 FAILED - Not enough mutant or control data
Caprin2tm2a(EUCOMM)Wtsi WTSI Dysmorphology / Tail length HOM 7f:7m Fisher Exact Test framework 1.00 Success
Caprin2tm2a(EUCOMM)Wtsi WTSI Heart Dissection / Body Weight HOM 7f:7m Mixed Model framework, linear mixed-effects model, equation withoutWeight 0.102 Success
Caprin2tm2a(EUCOMM)Wtsi WTSI Heart Dissection / Body Weight HOM 7f:7m Mixed Model framework, linear mixed-effects model, equation withoutWeight 0.102 Success
Caprin2tm2a(EUCOMM)Wtsi WTSI Heart Dissection / Heart weight HOM 7f:7m Mixed Model framework, linear mixed-effects model, equation withoutWeight 0.644 Success
Caprin2tm2a(EUCOMM)Wtsi WTSI Heart Dissection / Heart weight HOM 7f:7m Mixed Model framework, linear mixed-effects model, equation withoutWeight 0.644 Success
Caprin2tm2a(EUCOMM)Wtsi WTSI X-ray / Number of lumbar vertebrae HOM 7f:7m Mixed Model framework, generalized least squares, equation withoutWeight 0.501 Success
Caprin2tm2a(EUCOMM)Wtsi WTSI X-ray / Number of lumbar vertebrae HOM 7f:7m Mixed Model framework, generalized least squares, equation withoutWeight 0.501 Success
Caprin2tm2a(EUCOMM)Wtsi WTSI X-ray / Fusion of vertebrae HOM 7f:7m Fisher Exact Test framework 0.230 Success
Caprin2tm2a(EUCOMM)Wtsi WTSI X-ray / Fusion of vertebrae HOM 7f:7m Fisher Exact Test framework 0.230 Success
Caprin2tm2a(EUCOMM)Wtsi WTSI Heart Dissection / Visual abnormality HOM 7f:7m Fisher Exact Test framework 1.00 Not tested (No variation) - OK
Caprin2tm2a(EUCOMM)Wtsi WTSI Heart Dissection / Visual abnormality HOM 7f:7m Fisher Exact Test framework 1.00 Not tested (No variation) - OK
Caprin2tm2a(EUCOMM)Wtsi WTSI X-ray / Processes on vertebrae HOM 7f:7m Fisher Exact Test framework 0.538 Success
Caprin2tm2a(EUCOMM)Wtsi WTSI X-ray / Processes on vertebrae HOM 7f:7m Fisher Exact Test framework 0.538 Success
Caprin2tm2a(EUCOMM)Wtsi WTSI X-ray / Number of pelvic vertebrae HOM 7f:7m Mixed Model framework, generalized least squares, equation withoutWeight 0.430 Success
Caprin2tm2a(EUCOMM)Wtsi WTSI X-ray / Number of pelvic vertebrae HOM 7f:7m Mixed Model framework, generalized least squares, equation withoutWeight 0.430 Success
Caprin2tm2a(EUCOMM)Wtsi WTSI Buffy coat peripheral blood leukocyte immunophenotyping / T cell CD4+ percentage HOM 7f:7m Mixed Model framework, linear mixed-effects model, equation withoutWeight 0.463 Success
Caprin2tm2a(EUCOMM)Wtsi WTSI X-ray / Teeth HOM 7f:7m Fisher Exact Test framework 1.00 Success
Caprin2tm2a(EUCOMM)Wtsi WTSI X-ray / Teeth HOM 7f:7m Fisher Exact Test framework 1.00 Success
Caprin2tm2a(EUCOMM)Wtsi WTSI X-ray / Syndactylism HOM 7f:7m Fisher Exact Test framework 1.00 Not tested (No variation) - OK
Caprin2tm2a(EUCOMM)Wtsi WTSI X-ray / Syndactylism HOM 7f:7m Fisher Exact Test framework 1.00 Not tested (No variation) - OK
Caprin2tm2a(EUCOMM)Wtsi WTSI X-ray / Ulna HOM 7f:7m Fisher Exact Test framework 1.00 Success
Caprin2tm2a(EUCOMM)Wtsi WTSI X-ray / Ulna HOM 7f:7m Fisher Exact Test framework 1.00 Success
Caprin2tm2a(EUCOMM)Wtsi WTSI X-ray / Tibia HOM 7f:7m Fisher Exact Test framework 1.00 Not tested (No variation) - OK
Caprin2tm2a(EUCOMM)Wtsi WTSI X-ray / Tibia HOM 7f:7m Fisher Exact Test framework 1.00 Not tested (No variation) - OK
Caprin2tm2a(EUCOMM)Wtsi WTSI Viability Primary Screen / Outcome HOM 69f:68m Supplied as data Success
Caprin2tm2a(EUCOMM)Wtsi WTSI X-ray / Number of cervical vertebrae HOM 7f:7m Not processed 1.00 FAILED - testDataset returned an error, check log file
Caprin2tm2a(EUCOMM)Wtsi WTSI X-ray / Number of cervical vertebrae HOM 7f:7m Not processed 1.00 FAILED - testDataset returned an error, check log file
Caprin2tm2a(EUCOMM)Wtsi WTSI X-ray / Number of caudal vertebrae HOM 7f:7m Mixed Model framework, linear mixed-effects model, equation withoutWeight 0.00317 Success
Caprin2tm2a(EUCOMM)Wtsi WTSI X-ray / Number of caudal vertebrae HOM 7f:7m Mixed Model framework, linear mixed-effects model, equation withoutWeight 0.00317 Success
Caprin2tm2a(EUCOMM)Wtsi WTSI Buffy coat peripheral blood leukocyte immunophenotyping / T cell CD8+ percentage HOM 7f:7m Mixed Model framework, linear mixed-effects model, equation withoutWeight 0.0835 Success
Caprin2tm2a(EUCOMM)Wtsi WTSI Slit Lamp / cornea vascularisation HOM 7f:7m Fisher Exact Test framework 1.00 Success
Caprin2tm2a(EUCOMM)Wtsi WTSI Slit Lamp / cornea vascularisation HOM 7f:7m Fisher Exact Test framework 1.00 Success
Caprin2tm2a(EUCOMM)Wtsi WTSI Slit Lamp / cornea opacity HOM 7f:7m Fisher Exact Test framework 1.00 Success
Caprin2tm2a(EUCOMM)Wtsi WTSI Slit Lamp / cornea opacity HOM 7f:7m Fisher Exact Test framework 1.00 Success
Caprin2tm2a(EUCOMM)Wtsi WTSI Slit Lamp / lens HOM 7f:7m Fisher Exact Test framework 0.108 Success
Caprin2tm2a(EUCOMM)Wtsi WTSI Slit Lamp / lens HOM 7f:7m Fisher Exact Test framework 0.108 Success
Caprin2tm2a(EUCOMM)Wtsi WTSI X-ray / Shape of vertebrae HOM 7f:7m Fisher Exact Test framework 0.616 Success
Caprin2tm2a(EUCOMM)Wtsi WTSI X-ray / Shape of vertebrae HOM 7f:7m Fisher Exact Test framework 0.616 Success
Caprin2tm2a(EUCOMM)Wtsi WTSI Slit Lamp / Eye HOM 7f:7m Fisher Exact Test framework 0.252 Success
Caprin2tm2a(EUCOMM)Wtsi WTSI Slit Lamp / Eye HOM 7f:7m Fisher Exact Test framework 0.252 Success
Caprin2tm2a(EUCOMM)Wtsi WTSI Buffy coat peripheral blood leukocyte immunophenotyping / NK cell percentage HOM 7f:7m Mixed Model framework, linear mixed-effects model, equation withoutWeight 0.686 Success
Caprin2tm2a(EUCOMM)Wtsi WTSI X-ray / Number of thoracic vertebrae HOM 7f:7m Not processed 1.00 FAILED - No variability in dependent variable 'M.G.P_006_001_031'.
Caprin2tm2a(EUCOMM)Wtsi WTSI X-ray / Number of thoracic vertebrae HOM 7f:7m Not processed 1.00 FAILED - No variability in dependent variable 'M.G.P_006_001_031'.
Caprin2tm2a(EUCOMM)Wtsi WTSI Slit Lamp / Eye (+) blood presence HOM 7f:7m Fisher Exact Test framework 1.00 Not tested (No variation) - OK
Caprin2tm2a(EUCOMM)Wtsi WTSI Slit Lamp / Eye (+) blood presence HOM 7f:7m Fisher Exact Test framework 1.00 Not tested (No variation) - OK
Caprin2tm2a(EUCOMM)Wtsi WTSI Slit Lamp / Eye size HOM 7f:7m Fisher Exact Test framework 1.00 Not tested (No variation) - OK
Caprin2tm2a(EUCOMM)Wtsi WTSI Slit Lamp / Eye size HOM 7f:7m Fisher Exact Test framework 1.00 Not tested (No variation) - OK
Caprin2tm2a(EUCOMM)Wtsi WTSI Slit Lamp / cornea HOM 7f:7m Fisher Exact Test framework 0.370 Success
Caprin2tm2a(EUCOMM)Wtsi WTSI Slit Lamp / cornea HOM 7f:7m Fisher Exact Test framework 0.370 Success
Caprin2tm2a(EUCOMM)Wtsi WTSI Slit Lamp / Eyelid closure HOM 7f:7m Fisher Exact Test framework 1.00 Success
Caprin2tm2a(EUCOMM)Wtsi WTSI Slit Lamp / Eyelid closure HOM 7f:7m Fisher Exact Test framework 1.00 Success
Caprin2tm2a(EUCOMM)Wtsi WTSI Buffy coat peripheral blood leukocyte immunophenotyping / CD4+CD44+CD62L- percentage HOM 7f:7m Mixed Model framework, linear mixed-effects model, equation withoutWeight 0.530 Success
Caprin2tm2a(EUCOMM)Wtsi WTSI IPGTT / Body Weight HOM 3f:7m Not processed 1.00 FAILED - Not enough data points in dependent variable 'M.G.P_004_001_001' for genotype/sex combinations to allow the application of MM/TF framework. Threshold used: 4.
Caprin2tm2a(EUCOMM)Wtsi WTSI IPGTT / Body Weight HOM 3f:7m Not processed 1.00 FAILED - Not enough data points in dependent variable 'M.G.P_004_001_001' for genotype/sex combinations to allow the application of MM/TF framework. Threshold used: 4.
Caprin2tm2a(EUCOMM)Wtsi WTSI Antigen Specific Immunoglobulin Assay / TetC specific IgG2 HOM 0f:3m Not processed 1.00 FAILED - Not enough mutant or control data
Caprin2tm2a(EUCOMM)Wtsi WTSI Slit Lamp / Iris/Pupil HOM 7f:7m Fisher Exact Test framework 1.00 Success
Caprin2tm2a(EUCOMM)Wtsi WTSI Slit Lamp / Iris/Pupil HOM 7f:7m Fisher Exact Test framework 1.00 Success
Caprin2tm2a(EUCOMM)Wtsi WTSI Slit Lamp / lens opacity HOM 7f:7m Fisher Exact Test framework 0.0895 Success
Caprin2tm2a(EUCOMM)Wtsi WTSI Slit Lamp / lens opacity HOM 7f:7m Fisher Exact Test framework 0.0895 Success
Caprin2tm2a(EUCOMM)Wtsi WTSI Slit Lamp / Iris/Pupil shape HOM 7f:7m Fisher Exact Test framework 1.00 Success
Caprin2tm2a(EUCOMM)Wtsi WTSI Slit Lamp / Iris/Pupil shape HOM 7f:7m Fisher Exact Test framework 1.00 Success
Caprin2tm2a(EUCOMM)Wtsi WTSI Buffy coat peripheral blood leukocyte immunophenotyping / Granulocyte Gr1+ percentage HOM 7f:7m Mixed Model framework, linear mixed-effects model, equation withoutWeight 0.0534 Success
Caprin2tm2a(EUCOMM)Wtsi WTSI Slit Lamp / Iris/Pupil position HOM 7f:7m Fisher Exact Test framework 1.00 Success
Caprin2tm2a(EUCOMM)Wtsi WTSI Slit Lamp / Iris/Pupil position HOM 7f:7m Fisher Exact Test framework 1.00 Success
Caprin2tm2a(EUCOMM)Wtsi WTSI Slit Lamp / Iris pigment HOM 7f:7m Fisher Exact Test framework 1.00 Not tested (No variation) - OK
Caprin2tm2a(EUCOMM)Wtsi WTSI Slit Lamp / Iris pigment HOM 7f:7m Fisher Exact Test framework 1.00 Not tested (No variation) - OK
Caprin2tm2a(EUCOMM)Wtsi WTSI Slit Lamp / Iris/Pupil light response HOM 7f:7m Fisher Exact Test framework 1.00 Success
Caprin2tm2a(EUCOMM)Wtsi WTSI Slit Lamp / Iris/Pupil light response HOM 7f:7m Fisher Exact Test framework 1.00 Success
Caprin2tm2a(EUCOMM)Wtsi WTSI Modified SHIRPA / Body Position HOM 7f:7m Fisher Exact Test framework 0.0703 Success
Caprin2tm2a(EUCOMM)Wtsi WTSI Modified SHIRPA / Body Position HOM 7f:7m Fisher Exact Test framework 0.0703 Success
Caprin2tm2a(EUCOMM)Wtsi WTSI Modified SHIRPA / Body Position HOM 1f:0m - 1.00 FAILED - Not enough mutant or control data
Caprin2tm2a(EUCOMM)Wtsi WTSI Modified SHIRPA / Body Position HOM 1f:0m - 1.00 FAILED - Not enough mutant or control data
Caprin2tm2a(EUCOMM)Wtsi WTSI Modified SHIRPA / Defecation HOM 7f:7m Fisher Exact Test framework 0.431 Success
Caprin2tm2a(EUCOMM)Wtsi WTSI Modified SHIRPA / Defecation HOM 7f:7m Fisher Exact Test framework 0.431 Success
Caprin2tm2a(EUCOMM)Wtsi WTSI Modified SHIRPA / Defecation HOM 1f:0m - 1.00 FAILED - Not enough mutant or control data
Caprin2tm2a(EUCOMM)Wtsi WTSI Modified SHIRPA / Defecation HOM 1f:0m - 1.00 FAILED - Not enough mutant or control data
Caprin2tm2a(EUCOMM)Wtsi WTSI Modified SHIRPA / Tremor HOM 7f:7m Fisher Exact Test framework 0.326 Success
Caprin2tm2a(EUCOMM)Wtsi WTSI Modified SHIRPA / Tremor HOM 7f:7m Fisher Exact Test framework 0.326 Success
Caprin2tm2a(EUCOMM)Wtsi WTSI Modified SHIRPA / Tremor HOM 1f:0m - 1.00 FAILED - Not enough mutant or control data
Caprin2tm2a(EUCOMM)Wtsi WTSI Modified SHIRPA / Tremor HOM 1f:0m - 1.00 FAILED - Not enough mutant or control data
Caprin2tm2a(EUCOMM)Wtsi WTSI Modified SHIRPA / Palpebral Closure HOM 7f:7m Fisher Exact Test framework 1.00 Success
Caprin2tm2a(EUCOMM)Wtsi WTSI Modified SHIRPA / Palpebral Closure HOM 7f:7m Fisher Exact Test framework 1.00 Success
Caprin2tm2a(EUCOMM)Wtsi WTSI Modified SHIRPA / Palpebral Closure HOM 1f:0m - 1.00 FAILED - Not enough mutant or control data
Caprin2tm2a(EUCOMM)Wtsi WTSI Modified SHIRPA / Palpebral Closure HOM 1f:0m - 1.00 FAILED - Not enough mutant or control data
Caprin2tm2a(EUCOMM)Wtsi WTSI Modified SHIRPA / Urination HOM 1f:0m - 1.00 FAILED - Not enough mutant or control data
Caprin2tm2a(EUCOMM)Wtsi WTSI Modified SHIRPA / Urination HOM 7f:7m Fisher Exact Test framework 1.00 Success
Caprin2tm2a(EUCOMM)Wtsi WTSI Modified SHIRPA / Urination HOM 7f:7m Fisher Exact Test framework 1.00 Success
Caprin2tm2a(EUCOMM)Wtsi WTSI Modified SHIRPA / Urination HOM 1f:0m - 1.00 FAILED - Not enough mutant or control data
Caprin2tm2a(EUCOMM)Wtsi WTSI Modified SHIRPA / Transfer Arousal HOM 7f:7m Fisher Exact Test framework 0.640 Success
Caprin2tm2a(EUCOMM)Wtsi WTSI Modified SHIRPA / Transfer Arousal HOM 7f:7m Fisher Exact Test framework 0.640 Success
Caprin2tm2a(EUCOMM)Wtsi WTSI Modified SHIRPA / Transfer Arousal HOM 1f:0m - 1.00 FAILED - Not enough mutant or control data
Caprin2tm2a(EUCOMM)Wtsi WTSI Modified SHIRPA / Transfer Arousal HOM 1f:0m - 1.00 FAILED - Not enough mutant or control data
Caprin2tm2a(EUCOMM)Wtsi WTSI Modified SHIRPA / Lacrimation HOM 7f:7m Fisher Exact Test framework 1.00 Not tested (No variation) - OK
Caprin2tm2a(EUCOMM)Wtsi WTSI Modified SHIRPA / Lacrimation HOM 7f:7m Fisher Exact Test framework 1.00 Not tested (No variation) - OK
Caprin2tm2a(EUCOMM)Wtsi WTSI Modified SHIRPA / Lacrimation HOM 1f:0m - 1.00 FAILED - Not enough mutant or control data
Caprin2tm2a(EUCOMM)Wtsi WTSI Modified SHIRPA / Lacrimation HOM 1f:0m - 1.00 FAILED - Not enough mutant or control data
Caprin2tm2a(EUCOMM)Wtsi WTSI Modified SHIRPA / Gait HOM 7f:7m Fisher Exact Test framework 1.00 Success
Caprin2tm2a(EUCOMM)Wtsi WTSI Modified SHIRPA / Gait HOM 1f:0m - 1.00 FAILED - Not enough mutant or control data
Caprin2tm2a(EUCOMM)Wtsi WTSI Modified SHIRPA / Gait HOM 7f:7m Fisher Exact Test framework 1.00 Success
Caprin2tm2a(EUCOMM)Wtsi WTSI Modified SHIRPA / Gait HOM 1f:0m - 1.00 FAILED - Not enough mutant or control data
Caprin2tm2a(EUCOMM)Wtsi WTSI Modified SHIRPA / Locomotor activity HOM 7f:7m Mixed Model framework, generalized least squares, equation withoutWeight 0.373 Success
Caprin2tm2a(EUCOMM)Wtsi WTSI Modified SHIRPA / Locomotor activity HOM 7f:7m Mixed Model framework, generalized least squares, equation withoutWeight 0.373 Success
Caprin2tm2a(EUCOMM)Wtsi WTSI Modified SHIRPA / Locomotor activity HOM 1f:0m Not processed 1.00 FAILED - Not enough mutant or control data
Caprin2tm2a(EUCOMM)Wtsi WTSI Modified SHIRPA / Locomotor activity HOM 1f:0m Not processed 1.00 FAILED - Not enough mutant or control data
Caprin2tm2a(EUCOMM)Wtsi WTSI Ophthalmoscope / Left Retina Structure HOM 7f:7m Fisher Exact Test framework 1.00 Not tested (No variation) - OK
Caprin2tm2a(EUCOMM)Wtsi WTSI Ophthalmoscope / Left Retina Structure HOM 7f:7m Fisher Exact Test framework 1.00 Not tested (No variation) - OK
Caprin2tm2a(EUCOMM)Wtsi WTSI Ophthalmoscope / Left Retina Pigmentation HOM 7f:7m Fisher Exact Test framework 0.0840 Success
Caprin2tm2a(EUCOMM)Wtsi WTSI Ophthalmoscope / Left Retina Pigmentation HOM 7f:7m Fisher Exact Test framework 0.0840 Success
Caprin2tm2a(EUCOMM)Wtsi WTSI Ophthalmoscope / Right Retina HOM 7f:7m Fisher Exact Test framework 0.162 Success
Caprin2tm2a(EUCOMM)Wtsi WTSI Ophthalmoscope / Right Retina HOM 7f:7m Fisher Exact Test framework 0.162 Success
Caprin2tm2a(EUCOMM)Wtsi WTSI Ophthalmoscope / Left Optic Disc HOM 7f:7m Fisher Exact Test framework 1.00 Not tested (No variation) - OK
Caprin2tm2a(EUCOMM)Wtsi WTSI Ophthalmoscope / Left Optic Disc HOM 7f:7m Fisher Exact Test framework 1.00 Not tested (No variation) - OK
Caprin2tm2a(EUCOMM)Wtsi WTSI Ophthalmoscope / Eye HOM 7f:7m Fisher Exact Test framework 0.373 Success
Caprin2tm2a(EUCOMM)Wtsi WTSI Ophthalmoscope / Eye HOM 7f:7m Fisher Exact Test framework 0.373 Success
Caprin2tm2a(EUCOMM)Wtsi WTSI Ophthalmoscope / Left Retina HOM 7f:7m Fisher Exact Test framework 0.0840 Success
Caprin2tm2a(EUCOMM)Wtsi WTSI Ophthalmoscope / Left Retina HOM 7f:7m Fisher Exact Test framework 0.0840 Success
Caprin2tm2a(EUCOMM)Wtsi WTSI Clinical Chemistry / Creatine kinase HOM 7f:6m Mixed Model framework, linear mixed-effects model, equation withoutWeight 0.0478 Success
Caprin2tm2a(EUCOMM)Wtsi WTSI Clinical Chemistry / Creatine kinase HOM 7f:6m Mixed Model framework, linear mixed-effects model, equation withoutWeight 0.0478 Success
Caprin2tm2a(EUCOMM)Wtsi WTSI Clinical Chemistry / Creatine kinase HOM 0f:1m Not processed 1.00 FAILED - Not enough mutant or control data
Caprin2tm2a(EUCOMM)Wtsi WTSI Clinical Chemistry / Creatine kinase HOM 0f:1m Not processed 1.00 FAILED - Not enough mutant or control data
Caprin2tm2a(EUCOMM)Wtsi WTSI Ophthalmoscope / Right Retina Structure HOM 7f:7m Fisher Exact Test framework 1.00 Not tested (No variation) - OK
Caprin2tm2a(EUCOMM)Wtsi WTSI Ophthalmoscope / Right Retina Structure HOM 7f:7m Fisher Exact Test framework 1.00 Not tested (No variation) - OK
Caprin2tm2a(EUCOMM)Wtsi WTSI Ophthalmoscope / Right Retina Pigmentation HOM 7f:7m Fisher Exact Test framework 0.157 Success
Caprin2tm2a(EUCOMM)Wtsi WTSI Ophthalmoscope / Right Retina Pigmentation HOM 7f:7m Fisher Exact Test framework 0.157 Success
Caprin2tm2a(EUCOMM)Wtsi WTSI Clinical Chemistry / Total cholesterol HOM 7f:6m Mixed Model framework, linear mixed-effects model, equation withoutWeight 0.441 Success
Caprin2tm2a(EUCOMM)Wtsi WTSI Clinical Chemistry / Total cholesterol HOM 7f:6m Mixed Model framework, linear mixed-effects model, equation withoutWeight 0.441 Success
Caprin2tm2a(EUCOMM)Wtsi WTSI Clinical Chemistry / Total cholesterol HOM 0f:1m Not processed 1.00 FAILED - Not enough mutant or control data
Caprin2tm2a(EUCOMM)Wtsi WTSI Clinical Chemistry / Total cholesterol HOM 0f:1m Not processed 1.00 FAILED - Not enough mutant or control data
Caprin2tm2a(EUCOMM)Wtsi WTSI Clinical Chemistry / Alpha-amylase HOM 7f:6m Mixed Model framework, linear mixed-effects model, equation withoutWeight 0.0307 Success
Caprin2tm2a(EUCOMM)Wtsi WTSI Clinical Chemistry / Alpha-amylase HOM 7f:6m Mixed Model framework, linear mixed-effects model, equation withoutWeight 0.0307 Success
Caprin2tm2a(EUCOMM)Wtsi WTSI Clinical Chemistry / Alpha-amylase HOM 0f:1m Not processed 1.00 FAILED - Not enough mutant or control data
Caprin2tm2a(EUCOMM)Wtsi WTSI Clinical Chemistry / Alpha-amylase HOM 0f:1m Not processed 1.00 FAILED - Not enough mutant or control data
Caprin2tm2a(EUCOMM)Wtsi WTSI Fertility of Homozygous Knock-out Mice / Gross Findings Female HOM f:m Supplied as data Success
Caprin2tm2a(EUCOMM)Wtsi WTSI Clinical Chemistry / Alkaline phosphatase HOM 7f:6m Mixed Model framework, linear mixed-effects model, equation withoutWeight 0.761 Success
Caprin2tm2a(EUCOMM)Wtsi WTSI Clinical Chemistry / Alkaline phosphatase HOM 7f:6m Mixed Model framework, linear mixed-effects model, equation withoutWeight 0.761 Success
Caprin2tm2a(EUCOMM)Wtsi WTSI Clinical Chemistry / Alkaline phosphatase HOM 0f:1m Not processed 1.00 FAILED - Not enough mutant or control data
Caprin2tm2a(EUCOMM)Wtsi WTSI Clinical Chemistry / Alkaline phosphatase HOM 0f:1m Not processed 1.00 FAILED - Not enough mutant or control data
Caprin2tm2a(EUCOMM)Wtsi WTSI Clinical Chemistry / Alanine aminotransferase HOM 7f:6m Mixed Model framework, linear mixed-effects model, equation withoutWeight 0.921 Success
Caprin2tm2a(EUCOMM)Wtsi WTSI Clinical Chemistry / Alanine aminotransferase HOM 7f:6m Mixed Model framework, linear mixed-effects model, equation withoutWeight 0.921 Success
Caprin2tm2a(EUCOMM)Wtsi WTSI Clinical Chemistry / Alanine aminotransferase HOM 0f:1m Not processed 1.00 FAILED - Not enough mutant or control data
Caprin2tm2a(EUCOMM)Wtsi WTSI Clinical Chemistry / Alanine aminotransferase HOM 0f:1m Not processed 1.00 FAILED - Not enough mutant or control data
Caprin2tm2a(EUCOMM)Wtsi WTSI Clinical Chemistry / Aspartate aminotransferase HOM 7f:6m Mixed Model framework, linear mixed-effects model, equation withoutWeight 0.0719 Success
Caprin2tm2a(EUCOMM)Wtsi WTSI Clinical Chemistry / Aspartate aminotransferase HOM 7f:6m Mixed Model framework, linear mixed-effects model, equation withoutWeight 0.0719 Success
Caprin2tm2a(EUCOMM)Wtsi WTSI Clinical Chemistry / Aspartate aminotransferase HOM 0f:1m Not processed 1.00 FAILED - Not enough mutant or control data
Caprin2tm2a(EUCOMM)Wtsi WTSI Clinical Chemistry / Aspartate aminotransferase HOM 0f:1m Not processed 1.00 FAILED - Not enough mutant or control data
Caprin2tm2a(EUCOMM)Wtsi WTSI Body Weight / Body Weight HOM 37f:34m Mixed Model framework, linear mixed-effects model, equation withoutWeight 0.00184 Success
Caprin2tm2a(EUCOMM)Wtsi WTSI Body Weight / Body Weight HOM 37f:34m Mixed Model framework, linear mixed-effects model, equation withoutWeight 0.00184 Success
Caprin2tm2a(EUCOMM)Wtsi WTSI Body Weight / Body Weight HOM 6f:0m Mixed Model framework, linear mixed-effects model, equation withoutWeight 0.341 Success
Caprin2tm2a(EUCOMM)Wtsi WTSI Body Weight / Body Weight HOM 6f:0m Mixed Model framework, linear mixed-effects model, equation withoutWeight 0.341 Success
Caprin2tm2a(EUCOMM)Wtsi WTSI Clinical Chemistry / Lactate dehydrogenase HOM 0f:1m Not processed 1.00 FAILED - Not enough mutant or control data
Caprin2tm2a(EUCOMM)Wtsi WTSI Clinical Chemistry / Lactate dehydrogenase HOM 0f:1m Not processed 1.00 FAILED - Not enough mutant or control data
Caprin2tm2a(EUCOMM)Wtsi WTSI Clinical Chemistry / Iron HOM 7f:6m Mixed Model framework, linear mixed-effects model, equation withoutWeight 0.359 Success
Caprin2tm2a(EUCOMM)Wtsi WTSI Clinical Chemistry / Iron HOM 7f:6m Mixed Model framework, linear mixed-effects model, equation withoutWeight 0.359 Success
Caprin2tm2a(EUCOMM)Wtsi WTSI Clinical Chemistry / Iron HOM 0f:1m Not processed 1.00 FAILED - Not enough mutant or control data
Caprin2tm2a(EUCOMM)Wtsi WTSI Clinical Chemistry / Iron HOM 0f:1m Not processed 1.00 FAILED - Not enough mutant or control data
Caprin2tm2a(EUCOMM)Wtsi WTSI Modified SHIRPA / Tail elevation HOM 7f:7m Fisher Exact Test framework 0.579 Success
Caprin2tm2a(EUCOMM)Wtsi WTSI Modified SHIRPA / Tail elevation HOM 7f:7m Fisher Exact Test framework 0.579 Success
Caprin2tm2a(EUCOMM)Wtsi WTSI Modified SHIRPA / Tail elevation HOM 1f:0m - 1.00 FAILED - Not enough mutant or control data
Caprin2tm2a(EUCOMM)Wtsi WTSI Modified SHIRPA / Tail elevation HOM 1f:0m - 1.00 FAILED - Not enough mutant or control data
Caprin2tm2a(EUCOMM)Wtsi WTSI Buffy coat peripheral blood leukocyte immunophenotyping / T cell CD3+ percentage HOM 7f:7m Mixed Model framework, linear mixed-effects model, equation withoutWeight 0.183 Success
Caprin2tm2a(EUCOMM)Wtsi WTSI Clinical Chemistry / Phosphorus HOM 7f:6m Mixed Model framework, linear mixed-effects model, equation withoutWeight 0.996 Success
Caprin2tm2a(EUCOMM)Wtsi WTSI Clinical Chemistry / Phosphorus HOM 7f:6m Mixed Model framework, linear mixed-effects model, equation withoutWeight 0.996 Success
Caprin2tm2a(EUCOMM)Wtsi WTSI Clinical Chemistry / Phosphorus HOM 0f:1m Not processed 1.00 FAILED - Not enough mutant or control data
Caprin2tm2a(EUCOMM)Wtsi WTSI Clinical Chemistry / Phosphorus HOM 0f:1m Not processed 1.00 FAILED - Not enough mutant or control data
Caprin2tm2a(EUCOMM)Wtsi WTSI Modified SHIRPA / Pelvic elevation HOM 7f:7m Fisher Exact Test framework 1.00 Success
Caprin2tm2a(EUCOMM)Wtsi WTSI Modified SHIRPA / Pelvic elevation HOM 7f:7m Fisher Exact Test framework 1.00 Success
Caprin2tm2a(EUCOMM)Wtsi WTSI Modified SHIRPA / Pelvic elevation HOM 1f:0m - 1.00 FAILED - Not enough mutant or control data
Caprin2tm2a(EUCOMM)Wtsi WTSI Modified SHIRPA / Pelvic elevation HOM 1f:0m - 1.00 FAILED - Not enough mutant or control data
Caprin2tm2a(EUCOMM)Wtsi WTSI Modified SHIRPA / Touch Escape HOM 7f:7m Fisher Exact Test framework 0.657 Success
Caprin2tm2a(EUCOMM)Wtsi WTSI Modified SHIRPA / Touch Escape HOM 7f:7m Fisher Exact Test framework 0.657 Success
Caprin2tm2a(EUCOMM)Wtsi WTSI Modified SHIRPA / Touch Escape HOM 1f:0m - 1.00 FAILED - Not enough mutant or control data
Caprin2tm2a(EUCOMM)Wtsi WTSI Modified SHIRPA / Touch Escape HOM 1f:0m - 1.00 FAILED - Not enough mutant or control data
Caprin2tm2a(EUCOMM)Wtsi WTSI Modified SHIRPA / Startle Response HOM 7f:7m Fisher Exact Test framework 0.301 Success
Caprin2tm2a(EUCOMM)Wtsi WTSI Modified SHIRPA / Startle Response HOM 7f:7m Fisher Exact Test framework 0.301 Success
Caprin2tm2a(EUCOMM)Wtsi WTSI Modified SHIRPA / Startle Response HOM 1f:0m - 1.00 FAILED - Not enough mutant or control data
Caprin2tm2a(EUCOMM)Wtsi WTSI Modified SHIRPA / Startle Response HOM 1f:0m - 1.00 FAILED - Not enough mutant or control data
Caprin2tm2a(EUCOMM)Wtsi WTSI Ophthalmoscope / Right Optic Disc HOM 7f:7m Fisher Exact Test framework 1.00 Not tested (No variation) - OK
Caprin2tm2a(EUCOMM)Wtsi WTSI Ophthalmoscope / Right Optic Disc HOM 7f:7m Fisher Exact Test framework 1.00 Not tested (No variation) - OK
Caprin2tm2a(EUCOMM)Wtsi WTSI Modified SHIRPA / Trunk Curl HOM 7f:7m Fisher Exact Test framework 1.00 Success
Caprin2tm2a(EUCOMM)Wtsi WTSI Modified SHIRPA / Trunk Curl HOM 1f:0m - 1.00 FAILED - Not enough mutant or control data
Caprin2tm2a(EUCOMM)Wtsi WTSI Modified SHIRPA / Trunk Curl HOM 7f:7m Fisher Exact Test framework 1.00 Success
Caprin2tm2a(EUCOMM)Wtsi WTSI Modified SHIRPA / Trunk Curl HOM 1f:0m - 1.00 FAILED - Not enough mutant or control data
Caprin2tm2a(EUCOMM)Wtsi WTSI Modified SHIRPA / Positional Passivity HOM 7f:7m Fisher Exact Test framework 1.00 Not tested (No variation) - OK
Caprin2tm2a(EUCOMM)Wtsi WTSI Modified SHIRPA / Positional Passivity HOM 1f:0m - 1.00 FAILED - Not enough mutant or control data
Caprin2tm2a(EUCOMM)Wtsi WTSI Modified SHIRPA / Positional Passivity HOM 7f:7m Fisher Exact Test framework 1.00 Not tested (No variation) - OK
Caprin2tm2a(EUCOMM)Wtsi WTSI Modified SHIRPA / Positional Passivity HOM 1f:0m - 1.00 FAILED - Not enough mutant or control data
Caprin2tm2a(EUCOMM)Wtsi WTSI Modified SHIRPA / Pinna Reflex HOM 7f:7m Fisher Exact Test framework 1.00 Success
Caprin2tm2a(EUCOMM)Wtsi WTSI Modified SHIRPA / Pinna Reflex HOM 7f:7m Fisher Exact Test framework 1.00 Success
Caprin2tm2a(EUCOMM)Wtsi WTSI Modified SHIRPA / Pinna Reflex HOM 1f:0m - 1.00 FAILED - Not enough mutant or control data
Caprin2tm2a(EUCOMM)Wtsi WTSI Modified SHIRPA / Pinna Reflex HOM 1f:0m - 1.00 FAILED - Not enough mutant or control data
Caprin2tm2a(EUCOMM)Wtsi WTSI Modified SHIRPA / Limb Grasping HOM 7f:7m Fisher Exact Test framework 1.00 Success
Caprin2tm2a(EUCOMM)Wtsi WTSI Modified SHIRPA / Limb Grasping HOM 1f:0m - 1.00 FAILED - Not enough mutant or control data
Caprin2tm2a(EUCOMM)Wtsi WTSI Modified SHIRPA / Limb Grasping HOM 7f:7m Fisher Exact Test framework 1.00 Success
Caprin2tm2a(EUCOMM)Wtsi WTSI Modified SHIRPA / Limb Grasping HOM 1f:0m - 1.00 FAILED - Not enough mutant or control data
Caprin2tm2a(EUCOMM)Wtsi WTSI Clinical Chemistry / Free fatty acid HOM 7f:6m Mixed Model framework, linear mixed-effects model, equation withoutWeight 0.587 Success
Caprin2tm2a(EUCOMM)Wtsi WTSI Clinical Chemistry / Free fatty acid HOM 7f:6m Mixed Model framework, linear mixed-effects model, equation withoutWeight 0.587 Success
Caprin2tm2a(EUCOMM)Wtsi WTSI Clinical Chemistry / Free fatty acid HOM 0f:1m Not processed 1.00 FAILED - Not enough mutant or control data
Caprin2tm2a(EUCOMM)Wtsi WTSI Clinical Chemistry / Free fatty acid HOM 0f:1m Not processed 1.00 FAILED - Not enough mutant or control data
Caprin2tm2a(EUCOMM)Wtsi WTSI Clinical Chemistry / Triglyceride HOM 7f:6m Mixed Model framework, linear mixed-effects model, equation withoutWeight 0.481 Success
Caprin2tm2a(EUCOMM)Wtsi WTSI Clinical Chemistry / Triglyceride HOM 7f:6m Mixed Model framework, linear mixed-effects model, equation withoutWeight 0.481 Success
Caprin2tm2a(EUCOMM)Wtsi WTSI Clinical Chemistry / Triglyceride HOM 0f:1m Not processed 1.00 FAILED - Not enough mutant or control data
Caprin2tm2a(EUCOMM)Wtsi WTSI Clinical Chemistry / Triglyceride HOM 0f:1m Not processed 1.00 FAILED - Not enough mutant or control data
Caprin2tm2a(EUCOMM)Wtsi WTSI Modified SHIRPA / Corneal Reflex HOM 7f:7m Fisher Exact Test framework 1.00 Success
Caprin2tm2a(EUCOMM)Wtsi WTSI Modified SHIRPA / Corneal Reflex HOM 1f:0m - 1.00 FAILED - Not enough mutant or control data
Caprin2tm2a(EUCOMM)Wtsi WTSI Modified SHIRPA / Corneal Reflex HOM 7f:7m Fisher Exact Test framework 1.00 Success
Caprin2tm2a(EUCOMM)Wtsi WTSI Modified SHIRPA / Corneal Reflex HOM 1f:0m - 1.00 FAILED - Not enough mutant or control data
Caprin2tm2a(EUCOMM)Wtsi WTSI Dexa-scan analysis / Weight HOM 7f:7m Mixed Model framework, linear mixed-effects model, equation withoutWeight 0.102 Success
Caprin2tm2a(EUCOMM)Wtsi WTSI Dexa-scan analysis / Weight HOM 7f:7m Mixed Model framework, linear mixed-effects model, equation withoutWeight 0.102 Success
Caprin2tm2a(EUCOMM)Wtsi WTSI Ophthalmoscope / Right Eye Blood Vessels Pattern HOM 7f:7m Fisher Exact Test framework 1.00 Not tested (No variation) - OK
Caprin2tm2a(EUCOMM)Wtsi WTSI Ophthalmoscope / Right Eye Blood Vessels Pattern HOM 7f:7m Fisher Exact Test framework 1.00 Not tested (No variation) - OK
Caprin2tm2a(EUCOMM)Wtsi WTSI Dexa-scan analysis / Fat Mass HOM 7f:7m Mixed Model framework, linear mixed-effects model, equation withoutWeight 0.512 Success
Caprin2tm2a(EUCOMM)Wtsi WTSI Dexa-scan analysis / Fat Mass HOM 7f:7m Mixed Model framework, linear mixed-effects model, equation withoutWeight 0.512 Success
Caprin2tm2a(EUCOMM)Wtsi WTSI Ophthalmoscope / Right Eye Blood Vessels Structure HOM 7f:7m Fisher Exact Test framework 1.00 Not tested (No variation) - OK
Caprin2tm2a(EUCOMM)Wtsi WTSI Ophthalmoscope / Right Eye Blood Vessels Structure HOM 7f:7m Fisher Exact Test framework 1.00 Not tested (No variation) - OK
Caprin2tm2a(EUCOMM)Wtsi WTSI Ophthalmoscope / Body Weight HOM 7f:7m Mixed Model framework, linear mixed-effects model, equation withoutWeight 0.0425 Success
Caprin2tm2a(EUCOMM)Wtsi WTSI Ophthalmoscope / Body Weight HOM 7f:7m Mixed Model framework, linear mixed-effects model, equation withoutWeight 0.0425 Success
Caprin2tm2a(EUCOMM)Wtsi WTSI Dexa-scan analysis / Lean Mass HOM 7f:7m Mixed Model framework, linear mixed-effects model, equation withoutWeight 0.433 Success
Caprin2tm2a(EUCOMM)Wtsi WTSI Dexa-scan analysis / Lean Mass HOM 7f:7m Mixed Model framework, linear mixed-effects model, equation withoutWeight 0.433 Success
Caprin2tm2a(EUCOMM)Wtsi WTSI Dexa-scan analysis / Bone Mineral Density (excluding skull) HOM 7f:7m Mixed Model framework, linear mixed-effects model, equation withoutWeight 0.344 Success
Caprin2tm2a(EUCOMM)Wtsi WTSI Dexa-scan analysis / Bone Mineral Density (excluding skull) HOM 7f:7m Mixed Model framework, linear mixed-effects model, equation withoutWeight 0.344 Success
Caprin2tm2a(EUCOMM)Wtsi WTSI Ophthalmoscope / Left Eye Blood Vessels Structure HOM 7f:7m Fisher Exact Test framework 1.00 Not tested (No variation) - OK
Caprin2tm2a(EUCOMM)Wtsi WTSI Ophthalmoscope / Left Eye Blood Vessels Structure HOM 7f:7m Fisher Exact Test framework 1.00 Not tested (No variation) - OK
Caprin2tm2a(EUCOMM)Wtsi WTSI Ophthalmoscope / Left Eye Blood Vessels HOM 7f:7m Fisher Exact Test framework 1.00 Not tested (No variation) - OK
Caprin2tm2a(EUCOMM)Wtsi WTSI Ophthalmoscope / Left Eye Blood Vessels HOM 7f:7m Fisher Exact Test framework 1.00 Not tested (No variation) - OK
Caprin2tm2a(EUCOMM)Wtsi WTSI Ophthalmoscope / Right Eye Blood Vessels HOM 7f:7m Fisher Exact Test framework 1.00 Not tested (No variation) - OK
Caprin2tm2a(EUCOMM)Wtsi WTSI Ophthalmoscope / Right Eye Blood Vessels HOM 7f:7m Fisher Exact Test framework 1.00 Not tested (No variation) - OK
Caprin2tm2a(EUCOMM)Wtsi WTSI Ophthalmoscope / Left Eye Blood Vessels Pattern HOM 7f:7m Fisher Exact Test framework 1.00 Not tested (No variation) - OK
Caprin2tm2a(EUCOMM)Wtsi WTSI Ophthalmoscope / Left Eye Blood Vessels Pattern HOM 7f:7m Fisher Exact Test framework 1.00 Not tested (No variation) - OK
Caprin2tm2a(EUCOMM)Wtsi WTSI Clinical Chemistry / Magnesium HOM 7f:6m Mixed Model framework, linear mixed-effects model, equation withoutWeight 0.999 Success
Caprin2tm2a(EUCOMM)Wtsi WTSI Clinical Chemistry / Magnesium HOM 7f:6m Mixed Model framework, linear mixed-effects model, equation withoutWeight 0.999 Success
Caprin2tm2a(EUCOMM)Wtsi WTSI Clinical Chemistry / Magnesium HOM 0f:1m Not processed 1.00 FAILED - Not enough mutant or control data
Caprin2tm2a(EUCOMM)Wtsi WTSI Clinical Chemistry / Magnesium HOM 0f:1m Not processed 1.00 FAILED - Not enough mutant or control data
Caprin2tm2a(EUCOMM)Wtsi WTSI Dexa-scan analysis / Bone Mineral Content HOM 7f:7m Mixed Model framework, linear mixed-effects model, equation withoutWeight 0.0429 Success
Caprin2tm2a(EUCOMM)Wtsi WTSI Dexa-scan analysis / Bone Mineral Content HOM 7f:7m Mixed Model framework, linear mixed-effects model, equation withoutWeight 0.0429 Success
Caprin2tm2a(EUCOMM)Wtsi WTSI Dexa-scan analysis / Body Length HOM 7f:7m Mixed Model framework, linear mixed-effects model, equation withoutWeight 0.0820 Success
Caprin2tm2a(EUCOMM)Wtsi WTSI Dexa-scan analysis / Body Length HOM 7f:7m Mixed Model framework, linear mixed-effects model, equation withoutWeight 0.0820 Success
Caprin2tm2a(EUCOMM)Wtsi WTSI Fertility of Homozygous Knock-out Mice / Gross Findings Male HOM f:m Supplied as data Success
Caprin2tm2a(EUCOMM)Wtsi WTSI Clinical Chemistry / Fructosamine HOM 7f:6m Mixed Model framework, linear mixed-effects model, equation withoutWeight 0.199 Success
Caprin2tm2a(EUCOMM)Wtsi WTSI Clinical Chemistry / Fructosamine HOM 7f:6m Mixed Model framework, linear mixed-effects model, equation withoutWeight 0.199 Success
Caprin2tm2a(EUCOMM)Wtsi WTSI Clinical Chemistry / Fructosamine HOM 0f:1m Not processed 1.00 FAILED - Not enough mutant or control data
Caprin2tm2a(EUCOMM)Wtsi WTSI Clinical Chemistry / Fructosamine HOM 0f:1m Not processed 1.00 FAILED - Not enough mutant or control data
Caprin2tm2a(EUCOMM)Wtsi WTSI Dysmorphology / Head morphology HOM 7f:7m Fisher Exact Test framework 1.00 Not tested (No variation) - OK
Caprin2tm2a(EUCOMM)Wtsi WTSI Dysmorphology / Head morphology HOM 1f:0m - 1.00 FAILED - Not enough mutant or control data
Caprin2tm2a(EUCOMM)Wtsi WTSI Dysmorphology / Head morphology HOM 7f:7m Fisher Exact Test framework 1.00 Not tested (No variation) - OK
Caprin2tm2a(EUCOMM)Wtsi WTSI Dysmorphology / Head morphology HOM 1f:0m - 1.00 FAILED - Not enough mutant or control data
Caprin2tm2a(EUCOMM)Wtsi WTSI Dysmorphology / Head size HOM 1f:0m - 1.00 FAILED - Not enough mutant or control data
Caprin2tm2a(EUCOMM)Wtsi WTSI Dysmorphology / Head size HOM 7f:7m Fisher Exact Test framework 1.00 Not tested (No variation) - OK
Caprin2tm2a(EUCOMM)Wtsi WTSI Dysmorphology / Head size HOM 1f:0m - 1.00 FAILED - Not enough mutant or control data
Caprin2tm2a(EUCOMM)Wtsi WTSI Dysmorphology / Head size HOM 7f:7m Fisher Exact Test framework 1.00 Not tested (No variation) - OK
Caprin2tm2a(EUCOMM)Wtsi WTSI Clinical Chemistry / C-Reactive protein HOM 0f:1m Not processed 1.00 FAILED - Not enough mutant or control data
Caprin2tm2a(EUCOMM)Wtsi WTSI Clinical Chemistry / C-Reactive protein HOM 0f:1m Not processed 1.00 FAILED - Not enough mutant or control data
Caprin2tm2a(EUCOMM)Wtsi WTSI Dysmorphology / Skin pigmentation HOM 7f:7m Fisher Exact Test framework 0.568 Success
Caprin2tm2a(EUCOMM)Wtsi WTSI Dysmorphology / Skin pigmentation HOM 7f:7m Fisher Exact Test framework 0.568 Success
Caprin2tm2a(EUCOMM)Wtsi WTSI Dysmorphology / Skin pigmentation HOM 1f:0m - 1.00 FAILED - Not enough mutant or control data
Caprin2tm2a(EUCOMM)Wtsi WTSI Dysmorphology / Skin pigmentation HOM 1f:0m - 1.00 FAILED - Not enough mutant or control data
Caprin2tm2a(EUCOMM)Wtsi WTSI Clinical Chemistry / Transferrin HOM 0f:1m Not processed 1.00 FAILED - Not enough mutant or control data
Caprin2tm2a(EUCOMM)Wtsi WTSI Clinical Chemistry / Transferrin HOM 0f:1m Not processed 1.00 FAILED - Not enough mutant or control data
Caprin2tm2a(EUCOMM)Wtsi WTSI Dysmorphology / Skin condition HOM 7f:7m Fisher Exact Test framework 0.101 Success
Caprin2tm2a(EUCOMM)Wtsi WTSI Dysmorphology / Skin condition HOM 7f:7m Fisher Exact Test framework 0.101 Success
Caprin2tm2a(EUCOMM)Wtsi WTSI Dysmorphology / Skin condition HOM 1f:0m - 1.00 FAILED - Not enough mutant or control data
Caprin2tm2a(EUCOMM)Wtsi WTSI Dysmorphology / Skin condition HOM 1f:0m - 1.00 FAILED - Not enough mutant or control data
Caprin2tm2a(EUCOMM)Wtsi WTSI Clinical Chemistry / Ferretin HOM 0f:1m Not processed 1.00 FAILED - Not enough mutant or control data
Caprin2tm2a(EUCOMM)Wtsi WTSI Clinical Chemistry / Ferretin HOM 0f:1m Not processed 1.00 FAILED - Not enough mutant or control data
Caprin2tm2a(EUCOMM)Wtsi WTSI Modified SHIRPA / Evidence of Biting HOM 7f:7m Fisher Exact Test framework 0.612 Success
Caprin2tm2a(EUCOMM)Wtsi WTSI Modified SHIRPA / Evidence of Biting HOM 7f:7m Fisher Exact Test framework 0.612 Success
Caprin2tm2a(EUCOMM)Wtsi WTSI Modified SHIRPA / Evidence of Biting HOM 1f:0m - 1.00 FAILED - Not enough mutant or control data
Caprin2tm2a(EUCOMM)Wtsi WTSI Modified SHIRPA / Evidence of Biting HOM 1f:0m - 1.00 FAILED - Not enough mutant or control data
Caprin2tm2a(EUCOMM)Wtsi WTSI Clinical Chemistry / LDL-cholesterol HOM 7f:6m Mixed Model framework, linear mixed-effects model, equation withoutWeight 0.718 Success
Caprin2tm2a(EUCOMM)Wtsi WTSI Clinical Chemistry / LDL-cholesterol HOM 7f:6m Mixed Model framework, linear mixed-effects model, equation withoutWeight 0.718 Success
Caprin2tm2a(EUCOMM)Wtsi WTSI Clinical Chemistry / LDL-cholesterol HOM 0f:1m Not processed 1.00 FAILED - Not enough mutant or control data
Caprin2tm2a(EUCOMM)Wtsi WTSI Clinical Chemistry / LDL-cholesterol HOM 0f:1m Not processed 1.00 FAILED - Not enough mutant or control data
Caprin2tm2a(EUCOMM)Wtsi WTSI Clinical Chemistry / HDL-cholesterol HOM 7f:6m Mixed Model framework, linear mixed-effects model, equation withoutWeight 0.299 Success
Caprin2tm2a(EUCOMM)Wtsi WTSI Clinical Chemistry / HDL-cholesterol HOM 7f:6m Mixed Model framework, linear mixed-effects model, equation withoutWeight 0.299 Success
Caprin2tm2a(EUCOMM)Wtsi WTSI Clinical Chemistry / HDL-cholesterol HOM 0f:1m Not processed 1.00 FAILED - Not enough mutant or control data
Caprin2tm2a(EUCOMM)Wtsi WTSI Clinical Chemistry / HDL-cholesterol HOM 0f:1m Not processed 1.00 FAILED - Not enough mutant or control data
Caprin2tm2a(EUCOMM)Wtsi WTSI Buffy coat peripheral blood leukocyte immunophenotyping / Treg cell CD25+ percentage HOM 7f:7m Mixed Model framework, linear mixed-effects model, equation withoutWeight 0.324 Success
Caprin2tm2a(EUCOMM)Wtsi WTSI Modified SHIRPA / Contact Righting Reflex HOM 7f:7m Fisher Exact Test framework 1.00 Success
Caprin2tm2a(EUCOMM)Wtsi WTSI Modified SHIRPA / Contact Righting Reflex HOM 7f:7m Fisher Exact Test framework 1.00 Success
Caprin2tm2a(EUCOMM)Wtsi WTSI Modified SHIRPA / Contact Righting Reflex HOM 1f:0m - 1.00 FAILED - Not enough mutant or control data
Caprin2tm2a(EUCOMM)Wtsi WTSI Modified SHIRPA / Contact Righting Reflex HOM 1f:0m - 1.00 FAILED - Not enough mutant or control data
Caprin2tm2a(EUCOMM)Wtsi WTSI Clinical Chemistry / Total bilirubin HOM 7f:6m Mixed Model framework, generalized least squares, equation withoutWeight 0.666 Success
Caprin2tm2a(EUCOMM)Wtsi WTSI Clinical Chemistry / Total bilirubin HOM 7f:6m Mixed Model framework, generalized least squares, equation withoutWeight 0.666 Success
Caprin2tm2a(EUCOMM)Wtsi WTSI Clinical Chemistry / Total bilirubin HOM 0f:1m Not processed 1.00 FAILED - Not enough mutant or control data
Caprin2tm2a(EUCOMM)Wtsi WTSI Clinical Chemistry / Total bilirubin HOM 0f:1m Not processed 1.00 FAILED - Not enough mutant or control data
Caprin2tm2a(EUCOMM)Wtsi WTSI Modified SHIRPA / Vocalization HOM 7f:7m Fisher Exact Test framework 1.00 Success
Caprin2tm2a(EUCOMM)Wtsi WTSI Modified SHIRPA / Vocalization HOM 7f:7m Fisher Exact Test framework 1.00 Success
Caprin2tm2a(EUCOMM)Wtsi WTSI Modified SHIRPA / Vocalization HOM 1f:0m - 1.00 FAILED - Not enough mutant or control data
Caprin2tm2a(EUCOMM)Wtsi WTSI Modified SHIRPA / Vocalization HOM 1f:0m - 1.00 FAILED - Not enough mutant or control data
Caprin2tm2a(EUCOMM)Wtsi WTSI Clinical Chemistry / Uric acid HOM 0f:1m Not processed 1.00 FAILED - Not enough mutant or control data
Caprin2tm2a(EUCOMM)Wtsi WTSI Clinical Chemistry / Uric acid HOM 0f:1m Not processed 1.00 FAILED - Not enough mutant or control data
Caprin2tm2a(EUCOMM)Wtsi WTSI Dysmorphology / Body fat distribution HOM 1f:0m - 1.00 FAILED - Not enough mutant or control data
Caprin2tm2a(EUCOMM)Wtsi WTSI Dysmorphology / Body fat distribution HOM 7f:7m Fisher Exact Test framework 1.00 Not tested (No variation) - OK
Caprin2tm2a(EUCOMM)Wtsi WTSI Dysmorphology / Body fat distribution HOM 1f:0m - 1.00 FAILED - Not enough mutant or control data
Caprin2tm2a(EUCOMM)Wtsi WTSI Dysmorphology / Body fat distribution HOM 7f:7m Fisher Exact Test framework 1.00 Not tested (No variation) - OK
Caprin2tm2a(EUCOMM)Wtsi WTSI Grip Strength / Body weight HOM 7f:7m Mixed Model framework, linear mixed-effects model, equation withoutWeight 0.254 Success
Caprin2tm2a(EUCOMM)Wtsi WTSI Grip Strength / Body weight HOM 7f:7m Mixed Model framework, linear mixed-effects model, equation withoutWeight 0.254 Success
Caprin2tm2a(EUCOMM)Wtsi WTSI Grip Strength / Body weight HOM 1f:0m Not processed 1.00 FAILED - Not enough mutant or control data
Caprin2tm2a(EUCOMM)Wtsi WTSI Grip Strength / Body weight HOM 1f:0m Not processed 1.00 FAILED - Not enough mutant or control data
Caprin2tm2a(EUCOMM)Wtsi WTSI Dysmorphology / Coat texture HOM 7f:7m Fisher Exact Test framework 1.00 Success
Caprin2tm2a(EUCOMM)Wtsi WTSI Dysmorphology / Coat texture HOM 1f:0m - 1.00 FAILED - Not enough mutant or control data
Caprin2tm2a(EUCOMM)Wtsi WTSI Dysmorphology / Coat texture HOM 1f:0m - 1.00 FAILED - Not enough mutant or control data
Caprin2tm2a(EUCOMM)Wtsi WTSI Dysmorphology / Coat texture HOM 7f:7m Fisher Exact Test framework 1.00 Success
Caprin2tm2a(EUCOMM)Wtsi WTSI Dysmorphology / Coat colouration HOM 7f:7m Fisher Exact Test framework 0.587 Success
Caprin2tm2a(EUCOMM)Wtsi WTSI Dysmorphology / Coat colouration HOM 7f:7m Fisher Exact Test framework 0.587 Success
Caprin2tm2a(EUCOMM)Wtsi WTSI Dysmorphology / Coat colouration HOM 1f:0m - 1.00 FAILED - Not enough mutant or control data
Caprin2tm2a(EUCOMM)Wtsi WTSI Dysmorphology / Coat colouration HOM 1f:0m - 1.00 FAILED - Not enough mutant or control data
Caprin2tm2a(EUCOMM)Wtsi WTSI Dysmorphology / Coat intact HOM 7f:7m Fisher Exact Test framework 0.617 Success
Caprin2tm2a(EUCOMM)Wtsi WTSI Dysmorphology / Coat intact HOM 7f:7m Fisher Exact Test framework 0.617 Success
Caprin2tm2a(EUCOMM)Wtsi WTSI Dysmorphology / Coat intact HOM 1f:0m - 1.00 FAILED - Not enough mutant or control data
Caprin2tm2a(EUCOMM)Wtsi WTSI Dysmorphology / Coat intact HOM 1f:0m - 1.00 FAILED - Not enough mutant or control data
Caprin2tm2a(EUCOMM)Wtsi WTSI Clinical Chemistry / Glycerol HOM 7f:6m Mixed Model framework, linear mixed-effects model, equation withoutWeight 0.00478 Success
Caprin2tm2a(EUCOMM)Wtsi WTSI Clinical Chemistry / Glycerol HOM 7f:6m Mixed Model framework, linear mixed-effects model, equation withoutWeight 0.00478 Success
Caprin2tm2a(EUCOMM)Wtsi WTSI Clinical Chemistry / Glycerol HOM 0f:1m Not processed 1.00 FAILED - Not enough mutant or control data
Caprin2tm2a(EUCOMM)Wtsi WTSI Clinical Chemistry / Glycerol HOM 0f:1m Not processed 1.00 FAILED - Not enough mutant or control data
Caprin2tm2a(EUCOMM)Wtsi WTSI Dysmorphology / Muscle development HOM 7f:7m Fisher Exact Test framework 1.00 Not tested (No variation) - OK
Caprin2tm2a(EUCOMM)Wtsi WTSI Dysmorphology / Muscle development HOM 1f:0m - 1.00 FAILED - Not enough mutant or control data
Caprin2tm2a(EUCOMM)Wtsi WTSI Dysmorphology / Muscle development HOM 1f:0m - 1.00 FAILED - Not enough mutant or control data
Caprin2tm2a(EUCOMM)Wtsi WTSI Dysmorphology / Muscle development HOM 7f:7m Fisher Exact Test framework 1.00 Not tested (No variation) - OK

 Expression

IMPC lacZ Expression Data

 Expression  No Expression  Ambiguous  No Tissue Available
Anatomy #HET Specimens HOM Images? WT Expr Mutant Expr Images
Adrenal gland 2 No  (2/584) N/A
Aorta 2 No N/A
Blood vessel 2 No N/A
Bone 2 No N/A
Brain 2 No  (2/2) N/A
Brainstem 2 No N/A
Brown adipose tissue 2 No N/A
Cartilage tissue 2 No N/A
Cerebellum 2 No N/A
Cerebral cortex 2 No N/A
Eye 2 No  (2/2) N/A
Gall bladder 2 No N/A
Heart 2 No N/A
Hippocampus 2 No N/A
Hypothalamus 2 No N/A
Kidney 2 No  (18/584) N/A
Large intestine 2 No  (10/584) N/A
Liver 2 No N/A
Lower urinary tract 2 No N/A
Lung 2 No N/A
Lymph node 2 No N/A
Mammary gland 2 No N/A
Esophagus 2 No N/A
Olfactory lobe 2 No N/A
Ovary 2 No  (1/584) N/A
Oviduct 2 No N/A
Pancreas 2 No  (5/584) N/A
Parathyroid gland 2 No N/A
Peripheral nervous system 2 No  (2/2) N/A
Peyer's patch 2 No N/A
Pituitary gland 2 No N/A
Prostate gland 2 No  (12/584) N/A
Skeletal muscle tissue 2 No N/A
Skin 2 No N/A
Small intestine 2 No  (9/584) N/A
Spinal cord 2 No  (2/2) N/A
Spleen 2 No  (2/584) N/A
Stomach 2 No  (12/584) N/A
Striatum 2 No N/A
Testis 2 No  (2/584)  (1/2) N/A
Thymus 2 No N/A
Thyroid gland 2 No  (15/584) N/A
Trachea 2 No N/A
Uterus 2 No N/A
White adipose tissue 2 No N/A
No Embryo expression data was found for this gene.

 Associated Images

Phenotype associated images not available

 Disease Models

No associations by disease annotation and gene orthology found.
Please visit the desktop version to see this section

 Order Mouse and ES Cells

MGI Allele Allele Type Availability
Caprin2tm2a(EUCOMM)Wtsi KO first allele (reporter-tagged insertion with conditional potential) Mice, Targeting vectors, ES Cells
Caprin2tm1(KOMP)Vlcg Reporter-tagged deletion allele (with selection cassette) Targeting vectors, ES Cells
Caprin2tm1a(EUCOMM)Wtsi KO first allele (reporter-tagged insertion with conditional potential) Targeting vectors, ES Cells

The IMPC Newsletter

Get highlights of the most important data releases, news and events, delivered straight to your email inbox

Subscribe to newsletter