Gene: Slc25a29

Name
solute carrier family 25 (mitochondrial carrier, palmitoylcarnitine transporter), member 29
MGI ID
MGI:2444911
Synonyms
CACL mCACL C030003J19Rik
Viability
Homozygous - Viable
Other links
Significant phenotypes (0) All measurements (746) Expression & images (45) Disease models (0) Order (2)
View data by physiological system
Significant
Not Significant
Not tested

Filtered by: all phenotypes

Mouseover the data points for more information. Click and drag to zoom the chart. Click on the legends to disable/enable data.

Allele Center Procedure / Parameter Zygosity Mutants Statistical
Method
P Value Status
Slc25a29tm1a(KOMP)Wtsi WTSI Open Field / Number of entries in the center HOM 7f:4m Mixed Model framework, linear mixed-effects model, equation withoutWeight 0.586 Success
Slc25a29tm1a(KOMP)Wtsi WTSI Open Field / Number of entries in the center HOM 7f:4m Mixed Model framework, linear mixed-effects model, equation withoutWeight 0.586 Success
Slc25a29tm1a(KOMP)Wtsi WTSI Open Field / Number of entries in the center HOM 0f:3m Not processed 1.00 FAILED - Not enough mutant or control data
Slc25a29tm1a(KOMP)Wtsi WTSI Open Field / Number of entries in the center HOM 0f:3m Not processed 1.00 FAILED - Not enough mutant or control data
Slc25a29tm1a(KOMP)Wtsi WTSI Open Field / Latency to enter in the center HOM 7f:4m Mixed Model framework, generalized least squares, equation withoutWeight 0.0924 Success
Slc25a29tm1a(KOMP)Wtsi WTSI Open Field / Latency to enter in the center HOM 7f:4m Mixed Model framework, generalized least squares, equation withoutWeight 0.0924 Success
Slc25a29tm1a(KOMP)Wtsi WTSI Open Field / Latency to enter in the center HOM 0f:3m Not processed 1.00 FAILED - Not enough mutant or control data
Slc25a29tm1a(KOMP)Wtsi WTSI Open Field / Latency to enter in the center HOM 0f:3m Not processed 1.00 FAILED - Not enough mutant or control data
Slc25a29tm1a(KOMP)Wtsi WTSI Open Field / center - resting time HOM 7f:4m Mixed Model framework, generalized least squares, equation withoutWeight 0.504 Success
Slc25a29tm1a(KOMP)Wtsi WTSI Open Field / center - resting time HOM 7f:4m Mixed Model framework, generalized least squares, equation withoutWeight 0.504 Success
Slc25a29tm1a(KOMP)Wtsi WTSI Open Field / center - resting time HOM 0f:3m Not processed 1.00 FAILED - Not enough mutant or control data
Slc25a29tm1a(KOMP)Wtsi WTSI Open Field / center - resting time HOM 0f:3m Not processed 1.00 FAILED - Not enough mutant or control data
Slc25a29tm1a(KOMP)Wtsi WTSI Open Field / center - distance HOM 7f:4m Mixed Model framework, linear mixed-effects model, equation withoutWeight 0.324 Success
Slc25a29tm1a(KOMP)Wtsi WTSI Open Field / center - distance HOM 7f:4m Mixed Model framework, linear mixed-effects model, equation withoutWeight 0.324 Success
Slc25a29tm1a(KOMP)Wtsi WTSI Open Field / center - distance HOM 0f:3m Not processed 1.00 FAILED - Not enough mutant or control data
Slc25a29tm1a(KOMP)Wtsi WTSI Open Field / center - distance HOM 0f:3m Not processed 1.00 FAILED - Not enough mutant or control data
Slc25a29tm1a(KOMP)Wtsi WTSI Open Field / center - average Speed HOM 7f:4m Mixed Model framework, generalized least squares, equation withoutWeight 0.562 Success
Slc25a29tm1a(KOMP)Wtsi WTSI Open Field / center - average Speed HOM 7f:4m Mixed Model framework, generalized least squares, equation withoutWeight 0.562 Success
Slc25a29tm1a(KOMP)Wtsi WTSI Open Field / center - average Speed HOM 0f:3m Not processed 1.00 FAILED - Not enough mutant or control data
Slc25a29tm1a(KOMP)Wtsi WTSI Open Field / center - average Speed HOM 0f:3m Not processed 1.00 FAILED - Not enough mutant or control data
Slc25a29tm1a(KOMP)Wtsi WTSI Open Field / center - permanence time HOM 7f:4m Mixed Model framework, linear mixed-effects model, equation withoutWeight 0.263 Success
Slc25a29tm1a(KOMP)Wtsi WTSI Open Field / center - permanence time HOM 7f:4m Mixed Model framework, linear mixed-effects model, equation withoutWeight 0.263 Success
Slc25a29tm1a(KOMP)Wtsi WTSI Open Field / center - permanence time HOM 0f:3m Not processed 1.00 FAILED - Not enough mutant or control data
Slc25a29tm1a(KOMP)Wtsi WTSI Open Field / center - permanence time HOM 0f:3m Not processed 1.00 FAILED - Not enough mutant or control data
Slc25a29tm1a(KOMP)Wtsi WTSI Haematology test / Haemoglobin HOM 7f:4m Mixed Model framework, linear mixed-effects model, equation withoutWeight 0.190 Success
Slc25a29tm1a(KOMP)Wtsi WTSI Haematology test / Haemoglobin HOM 7f:4m Mixed Model framework, linear mixed-effects model, equation withoutWeight 0.190 Success
Slc25a29tm1a(KOMP)Wtsi WTSI Haematology test / Haemoglobin HOM 0f:3m Not processed 1.00 FAILED - Not enough mutant or control data
Slc25a29tm1a(KOMP)Wtsi WTSI Haematology test / Haemoglobin HOM 0f:3m Not processed 1.00 FAILED - Not enough mutant or control data
Slc25a29tm1a(KOMP)Wtsi WTSI Haematology test / Haematocrit HOM 7f:4m Mixed Model framework, linear mixed-effects model, equation withoutWeight 0.0468 Success
Slc25a29tm1a(KOMP)Wtsi WTSI Haematology test / Haematocrit HOM 7f:4m Mixed Model framework, linear mixed-effects model, equation withoutWeight 0.0468 Success
Slc25a29tm1a(KOMP)Wtsi WTSI Haematology test / Haematocrit HOM 0f:3m Not processed 1.00 FAILED - Not enough mutant or control data
Slc25a29tm1a(KOMP)Wtsi WTSI Haematology test / Haematocrit HOM 0f:3m Not processed 1.00 FAILED - Not enough mutant or control data
Slc25a29tm1a(KOMP)Wtsi WTSI Haematology test / White blood cell-count HOM 7f:4m Mixed Model framework, linear mixed-effects model, equation withoutWeight 0.0652 Success
Slc25a29tm1a(KOMP)Wtsi WTSI Haematology test / White blood cell-count HOM 7f:4m Mixed Model framework, linear mixed-effects model, equation withoutWeight 0.0652 Success
Slc25a29tm1a(KOMP)Wtsi WTSI Haematology test / White blood cell-count HOM 0f:3m Not processed 1.00 FAILED - Not enough mutant or control data
Slc25a29tm1a(KOMP)Wtsi WTSI Haematology test / White blood cell-count HOM 0f:3m Not processed 1.00 FAILED - Not enough mutant or control data
Slc25a29tm1a(KOMP)Wtsi WTSI Haematology test / Red Blood Cell-count HOM 7f:4m Mixed Model framework, linear mixed-effects model, equation withoutWeight 0.219 Success
Slc25a29tm1a(KOMP)Wtsi WTSI Haematology test / Red Blood Cell-count HOM 7f:4m Mixed Model framework, linear mixed-effects model, equation withoutWeight 0.219 Success
Slc25a29tm1a(KOMP)Wtsi WTSI Haematology test / Red Blood Cell-count HOM 0f:3m Not processed 1.00 FAILED - Not enough mutant or control data
Slc25a29tm1a(KOMP)Wtsi WTSI Haematology test / Red Blood Cell-count HOM 0f:3m Not processed 1.00 FAILED - Not enough mutant or control data
Slc25a29tm1a(KOMP)Wtsi WTSI Haematology test / Mean-cell-haemoglobin-conc HOM 7f:4m Mixed Model framework, linear mixed-effects model, equation withoutWeight 0.306 Success
Slc25a29tm1a(KOMP)Wtsi WTSI Haematology test / Mean-cell-haemoglobin-conc HOM 7f:4m Mixed Model framework, linear mixed-effects model, equation withoutWeight 0.306 Success
Slc25a29tm1a(KOMP)Wtsi WTSI Haematology test / Mean-cell-haemoglobin-conc HOM 0f:3m Not processed 1.00 FAILED - Not enough mutant or control data
Slc25a29tm1a(KOMP)Wtsi WTSI Haematology test / Mean-cell-haemoglobin-conc HOM 0f:3m Not processed 1.00 FAILED - Not enough mutant or control data
Slc25a29tm1a(KOMP)Wtsi WTSI Haematology test / Platelets-count HOM 7f:4m Mixed Model framework, linear mixed-effects model, equation withoutWeight 0.535 Success
Slc25a29tm1a(KOMP)Wtsi WTSI Haematology test / Platelets-count HOM 7f:4m Mixed Model framework, linear mixed-effects model, equation withoutWeight 0.535 Success
Slc25a29tm1a(KOMP)Wtsi WTSI Haematology test / Platelets-count HOM 0f:3m Not processed 1.00 FAILED - Not enough mutant or control data
Slc25a29tm1a(KOMP)Wtsi WTSI Haematology test / Platelets-count HOM 0f:3m Not processed 1.00 FAILED - Not enough mutant or control data
Slc25a29tm1a(KOMP)Wtsi WTSI Haematology test / Mean-cell-volume HOM 7f:4m Mixed Model framework, linear mixed-effects model, equation withoutWeight 0.267 Success
Slc25a29tm1a(KOMP)Wtsi WTSI Haematology test / Mean-cell-volume HOM 7f:4m Mixed Model framework, linear mixed-effects model, equation withoutWeight 0.267 Success
Slc25a29tm1a(KOMP)Wtsi WTSI Haematology test / Mean-cell-volume HOM 0f:3m Not processed 1.00 FAILED - Not enough mutant or control data
Slc25a29tm1a(KOMP)Wtsi WTSI Haematology test / Mean-cell-volume HOM 0f:3m Not processed 1.00 FAILED - Not enough mutant or control data
Slc25a29tm1a(KOMP)Wtsi WTSI Haematology test / Mean-corpuscular-haemoglobin HOM 7f:4m Mixed Model framework, linear mixed-effects model, equation withoutWeight 0.988 Success
Slc25a29tm1a(KOMP)Wtsi WTSI Haematology test / Mean-corpuscular-haemoglobin HOM 7f:4m Mixed Model framework, linear mixed-effects model, equation withoutWeight 0.988 Success
Slc25a29tm1a(KOMP)Wtsi WTSI Haematology test / Mean-corpuscular-haemoglobin HOM 0f:3m Not processed 1.00 FAILED - Not enough mutant or control data
Slc25a29tm1a(KOMP)Wtsi WTSI Haematology test / Mean-corpuscular-haemoglobin HOM 0f:3m Not processed 1.00 FAILED - Not enough mutant or control data
Slc25a29tm1a(KOMP)Wtsi WTSI Clinical Chemistry / Chloride HOM 7f:4m Mixed Model framework, linear mixed-effects model, equation withoutWeight 0.107 Success
Slc25a29tm1a(KOMP)Wtsi WTSI Clinical Chemistry / Chloride HOM 7f:4m Mixed Model framework, linear mixed-effects model, equation withoutWeight 0.107 Success
Slc25a29tm1a(KOMP)Wtsi WTSI Clinical Chemistry / Chloride HOM 0f:3m Not processed 1.00 FAILED - Not enough mutant or control data
Slc25a29tm1a(KOMP)Wtsi WTSI Clinical Chemistry / Chloride HOM 0f:3m Not processed 1.00 FAILED - Not enough mutant or control data
Slc25a29tm1a(KOMP)Wtsi WTSI Clinical Chemistry / Potassium HOM 7f:4m Mixed Model framework, linear mixed-effects model, equation withoutWeight 0.464 Success
Slc25a29tm1a(KOMP)Wtsi WTSI Clinical Chemistry / Potassium HOM 7f:4m Mixed Model framework, linear mixed-effects model, equation withoutWeight 0.464 Success
Slc25a29tm1a(KOMP)Wtsi WTSI Clinical Chemistry / Potassium HOM 0f:3m Not processed 1.00 FAILED - Not enough mutant or control data
Slc25a29tm1a(KOMP)Wtsi WTSI Clinical Chemistry / Potassium HOM 0f:3m Not processed 1.00 FAILED - Not enough mutant or control data
Slc25a29tm1a(KOMP)Wtsi WTSI Clinical Chemistry / Sodium HOM 7f:4m Mixed Model framework, linear mixed-effects model, equation withoutWeight 0.133 Success
Slc25a29tm1a(KOMP)Wtsi WTSI Clinical Chemistry / Sodium HOM 7f:4m Mixed Model framework, linear mixed-effects model, equation withoutWeight 0.133 Success
Slc25a29tm1a(KOMP)Wtsi WTSI Clinical Chemistry / Sodium HOM 0f:3m Not processed 1.00 FAILED - Not enough mutant or control data
Slc25a29tm1a(KOMP)Wtsi WTSI Clinical Chemistry / Sodium HOM 0f:3m Not processed 1.00 FAILED - Not enough mutant or control data
Slc25a29tm1a(KOMP)Wtsi WTSI Clinical Chemistry / Creatinine HOM 7f:4m Mixed Model framework, linear mixed-effects model, equation withoutWeight 0.732 Success
Slc25a29tm1a(KOMP)Wtsi WTSI Clinical Chemistry / Creatinine HOM 7f:4m Mixed Model framework, linear mixed-effects model, equation withoutWeight 0.732 Success
Slc25a29tm1a(KOMP)Wtsi WTSI Clinical Chemistry / Creatinine HOM 0f:3m Not processed 1.00 FAILED - Not enough mutant or control data
Slc25a29tm1a(KOMP)Wtsi WTSI Clinical Chemistry / Creatinine HOM 0f:3m Not processed 1.00 FAILED - Not enough mutant or control data
Slc25a29tm1a(KOMP)Wtsi WTSI Clinical Chemistry / Urea HOM 7f:4m Mixed Model framework, linear mixed-effects model, equation withoutWeight 0.0139 Success
Slc25a29tm1a(KOMP)Wtsi WTSI Clinical Chemistry / Urea HOM 7f:4m Mixed Model framework, linear mixed-effects model, equation withoutWeight 0.0139 Success
Slc25a29tm1a(KOMP)Wtsi WTSI Clinical Chemistry / Urea HOM 0f:3m Not processed 1.00 FAILED - Not enough mutant or control data
Slc25a29tm1a(KOMP)Wtsi WTSI Clinical Chemistry / Urea HOM 0f:3m Not processed 1.00 FAILED - Not enough mutant or control data
Slc25a29tm1a(KOMP)Wtsi WTSI Buffy coat peripheral blood leukocyte immunophenotyping / Monocyte percentage HOM 7f:4m Mixed Model framework, linear mixed-effects model, equation withoutWeight 0.514 Success
Slc25a29tm1a(KOMP)Wtsi WTSI Clinical Chemistry / Glucose HOM 7f:4m Mixed Model framework, linear mixed-effects model, equation withoutWeight 0.825 Success
Slc25a29tm1a(KOMP)Wtsi WTSI Clinical Chemistry / Glucose HOM 7f:4m Mixed Model framework, linear mixed-effects model, equation withoutWeight 0.825 Success
Slc25a29tm1a(KOMP)Wtsi WTSI Clinical Chemistry / Glucose HOM 0f:3m Not processed 1.00 FAILED - Not enough mutant or control data
Slc25a29tm1a(KOMP)Wtsi WTSI Clinical Chemistry / Glucose HOM 0f:3m Not processed 1.00 FAILED - Not enough mutant or control data
Slc25a29tm1a(KOMP)Wtsi WTSI Buffy coat peripheral blood leukocyte immunophenotyping / CD8+CD44+CD62L- percentage HOM 7f:4m Mixed Model framework, linear mixed-effects model, equation withoutWeight 0.458 Success
Slc25a29tm1a(KOMP)Wtsi WTSI Clinical Chemistry / Calcium HOM 7f:4m Mixed Model framework, linear mixed-effects model, equation withoutWeight 0.725 Success
Slc25a29tm1a(KOMP)Wtsi WTSI Clinical Chemistry / Calcium HOM 7f:4m Mixed Model framework, linear mixed-effects model, equation withoutWeight 0.725 Success
Slc25a29tm1a(KOMP)Wtsi WTSI Clinical Chemistry / Calcium HOM 0f:3m Not processed 1.00 FAILED - Not enough mutant or control data
Slc25a29tm1a(KOMP)Wtsi WTSI Clinical Chemistry / Calcium HOM 0f:3m Not processed 1.00 FAILED - Not enough mutant or control data
Slc25a29tm1a(KOMP)Wtsi WTSI Clinical Chemistry / Albumin HOM 7f:4m Mixed Model framework, linear mixed-effects model, equation withoutWeight 0.325 Success
Slc25a29tm1a(KOMP)Wtsi WTSI Clinical Chemistry / Albumin HOM 7f:4m Mixed Model framework, linear mixed-effects model, equation withoutWeight 0.325 Success
Slc25a29tm1a(KOMP)Wtsi WTSI Clinical Chemistry / Albumin HOM 0f:3m Not processed 1.00 FAILED - Not enough mutant or control data
Slc25a29tm1a(KOMP)Wtsi WTSI Clinical Chemistry / Albumin HOM 0f:3m Not processed 1.00 FAILED - Not enough mutant or control data
Slc25a29tm1a(KOMP)Wtsi WTSI Clinical Chemistry / Total protein HOM 7f:4m Mixed Model framework, linear mixed-effects model, equation withoutWeight 0.713 Success
Slc25a29tm1a(KOMP)Wtsi WTSI Clinical Chemistry / Total protein HOM 7f:4m Mixed Model framework, linear mixed-effects model, equation withoutWeight 0.713 Success
Slc25a29tm1a(KOMP)Wtsi WTSI Clinical Chemistry / Total protein HOM 0f:3m Not processed 1.00 FAILED - Not enough mutant or control data
Slc25a29tm1a(KOMP)Wtsi WTSI Clinical Chemistry / Total protein HOM 0f:3m Not processed 1.00 FAILED - Not enough mutant or control data
Slc25a29tm1a(KOMP)Wtsi WTSI Antigen Specific Immunoglobulin Assay / TetC specific total IgG HOM 0f:4m Mixed Model framework, linear mixed-effects model, equation withoutWeight 0.738 Success
Slc25a29tm1a(KOMP)Wtsi WTSI Heart Dissection / Body Weight HOM 7f:4m Mixed Model framework, linear mixed-effects model, equation withoutWeight 0.338 Success
Slc25a29tm1a(KOMP)Wtsi WTSI Heart Dissection / Body Weight HOM 7f:4m Mixed Model framework, linear mixed-effects model, equation withoutWeight 0.338 Success
Slc25a29tm1a(KOMP)Wtsi WTSI Heart Dissection / Body Weight HOM 0f:3m Not processed 1.00 FAILED - Not enough mutant or control data
Slc25a29tm1a(KOMP)Wtsi WTSI Heart Dissection / Body Weight HOM 0f:3m Not processed 1.00 FAILED - Not enough mutant or control data
Slc25a29tm1a(KOMP)Wtsi WTSI Heart Dissection / Tibia Length HOM 0f:3m Not processed 1.00 FAILED - Not enough mutant or control data
Slc25a29tm1a(KOMP)Wtsi WTSI Heart Dissection / Tibia Length HOM 0f:3m Not processed 1.00 FAILED - Not enough mutant or control data
Slc25a29tm1a(KOMP)Wtsi WTSI Heart Dissection / Heart weight HOM 7f:4m Mixed Model framework, linear mixed-effects model, equation withoutWeight 0.287 Success
Slc25a29tm1a(KOMP)Wtsi WTSI Heart Dissection / Heart weight HOM 7f:4m Mixed Model framework, linear mixed-effects model, equation withoutWeight 0.287 Success
Slc25a29tm1a(KOMP)Wtsi WTSI Heart Dissection / Heart weight HOM 0f:3m Not processed 1.00 FAILED - Not enough mutant or control data
Slc25a29tm1a(KOMP)Wtsi WTSI Heart Dissection / Heart weight HOM 0f:3m Not processed 1.00 FAILED - Not enough mutant or control data
Slc25a29tm1a(KOMP)Wtsi WTSI Open Field / Periphery - Permanence Time HOM 7f:4m Mixed Model framework, linear mixed-effects model, equation withoutWeight 0.262 Success
Slc25a29tm1a(KOMP)Wtsi WTSI Open Field / Periphery - Permanence Time HOM 7f:4m Mixed Model framework, linear mixed-effects model, equation withoutWeight 0.262 Success
Slc25a29tm1a(KOMP)Wtsi WTSI Open Field / Periphery - Permanence Time HOM 0f:3m Not processed 1.00 FAILED - Not enough mutant or control data
Slc25a29tm1a(KOMP)Wtsi WTSI Open Field / Periphery - Permanence Time HOM 0f:3m Not processed 1.00 FAILED - Not enough mutant or control data
Slc25a29tm1a(KOMP)Wtsi WTSI Open Field / Periphery - resting time HOM 7f:4m Mixed Model framework, linear mixed-effects model, equation withoutWeight 0.905 Success
Slc25a29tm1a(KOMP)Wtsi WTSI Open Field / Periphery - resting time HOM 7f:4m Mixed Model framework, linear mixed-effects model, equation withoutWeight 0.905 Success
Slc25a29tm1a(KOMP)Wtsi WTSI Open Field / Periphery - resting time HOM 0f:3m Not processed 1.00 FAILED - Not enough mutant or control data
Slc25a29tm1a(KOMP)Wtsi WTSI Open Field / Periphery - resting time HOM 0f:3m Not processed 1.00 FAILED - Not enough mutant or control data
Slc25a29tm1a(KOMP)Wtsi WTSI Heart Dissection / Visual abnormality HOM 7f:4m Fisher Exact Test framework 1.00 Not tested (No variation) - OK
Slc25a29tm1a(KOMP)Wtsi WTSI Heart Dissection / Visual abnormality HOM 7f:4m Fisher Exact Test framework 1.00 Not tested (No variation) - OK
Slc25a29tm1a(KOMP)Wtsi WTSI Heart Dissection / Visual abnormality HOM 0f:3m - 1.00 FAILED - Not enough mutant or control data
Slc25a29tm1a(KOMP)Wtsi WTSI Heart Dissection / Visual abnormality HOM 0f:3m - 1.00 FAILED - Not enough mutant or control data
Slc25a29tm1a(KOMP)Wtsi WTSI Heart Dissection / Histology abnormality HOM 0f:3m Not processed 1.00 FAILED - Not enough mutant or control data
Slc25a29tm1a(KOMP)Wtsi WTSI Heart Dissection / Histology abnormality HOM 0f:3m Not processed 1.00 FAILED - Not enough mutant or control data
Slc25a29tm1a(KOMP)Wtsi WTSI Open Field / Periphery - average Speed HOM 7f:4m Mixed Model framework, linear mixed-effects model, equation withoutWeight 0.915 Success
Slc25a29tm1a(KOMP)Wtsi WTSI Open Field / Periphery - average Speed HOM 7f:4m Mixed Model framework, linear mixed-effects model, equation withoutWeight 0.915 Success
Slc25a29tm1a(KOMP)Wtsi WTSI Open Field / Periphery - average Speed HOM 0f:3m Not processed 1.00 FAILED - Not enough mutant or control data
Slc25a29tm1a(KOMP)Wtsi WTSI Open Field / Periphery - average Speed HOM 0f:3m Not processed 1.00 FAILED - Not enough mutant or control data
Slc25a29tm1a(KOMP)Wtsi WTSI Open Field / Whole Arena - Permanence Time HOM 7f:4m Not processed 1.00 FAILED - No variability in dependent variable 'M.G.P_007_001_004'.
Slc25a29tm1a(KOMP)Wtsi WTSI Open Field / Whole Arena - Permanence Time HOM 0f:3m Not processed 1.00 FAILED - Not enough mutant or control data
Slc25a29tm1a(KOMP)Wtsi WTSI Open Field / Whole Arena - Permanence Time HOM 0f:3m Not processed 1.00 FAILED - Not enough mutant or control data
Slc25a29tm1a(KOMP)Wtsi WTSI Open Field / Whole Arena - Permanence Time HOM 7f:4m Not processed 1.00 FAILED - No variability in dependent variable 'M.G.P_007_001_004'.
Slc25a29tm1a(KOMP)Wtsi WTSI Open Field / Whole Arena - resting time HOM 7f:4m Mixed Model framework, linear mixed-effects model, equation withoutWeight 0.899 Success
Slc25a29tm1a(KOMP)Wtsi WTSI Open Field / Whole Arena - resting time HOM 7f:4m Mixed Model framework, linear mixed-effects model, equation withoutWeight 0.899 Success
Slc25a29tm1a(KOMP)Wtsi WTSI Open Field / Whole Arena - resting time HOM 0f:3m Not processed 1.00 FAILED - Not enough mutant or control data
Slc25a29tm1a(KOMP)Wtsi WTSI Open Field / Whole Arena - resting time HOM 0f:3m Not processed 1.00 FAILED - Not enough mutant or control data
Slc25a29tm1a(KOMP)Wtsi WTSI Open Field / Periphery - distance HOM 7f:4m Mixed Model framework, linear mixed-effects model, equation withoutWeight 0.956 Success
Slc25a29tm1a(KOMP)Wtsi WTSI Open Field / Periphery - distance HOM 7f:4m Mixed Model framework, linear mixed-effects model, equation withoutWeight 0.956 Success
Slc25a29tm1a(KOMP)Wtsi WTSI Open Field / Periphery - distance HOM 0f:3m Not processed 1.00 FAILED - Not enough mutant or control data
Slc25a29tm1a(KOMP)Wtsi WTSI Open Field / Periphery - distance HOM 0f:3m Not processed 1.00 FAILED - Not enough mutant or control data
Slc25a29tm1a(KOMP)Wtsi WTSI Open Field / Whole Arena - average Speed HOM 7f:4m Mixed Model framework, linear mixed-effects model, equation withoutWeight 0.945 Success
Slc25a29tm1a(KOMP)Wtsi WTSI Open Field / Whole Arena - average Speed HOM 7f:4m Mixed Model framework, linear mixed-effects model, equation withoutWeight 0.945 Success
Slc25a29tm1a(KOMP)Wtsi WTSI Open Field / Whole Arena - average Speed HOM 0f:3m Not processed 1.00 FAILED - Not enough mutant or control data
Slc25a29tm1a(KOMP)Wtsi WTSI Open Field / Whole Arena - average Speed HOM 0f:3m Not processed 1.00 FAILED - Not enough mutant or control data
Slc25a29tm1a(KOMP)Wtsi WTSI Viability Primary Screen / Outcome HOM 44f:39m Supplied as data Success
Slc25a29tm1a(KOMP)Wtsi WTSI Buffy coat peripheral blood leukocyte immunophenotyping / T cell CD8+ percentage HOM 7f:4m Mixed Model framework, linear mixed-effects model, equation withoutWeight 0.897 Success
Slc25a29tm1a(KOMP)Wtsi WTSI Buffy coat peripheral blood leukocyte immunophenotyping / NK cell percentage HOM 7f:4m Mixed Model framework, linear mixed-effects model, equation withoutWeight 0.395 Success
Slc25a29tm1a(KOMP)Wtsi WTSI IPGTT / Body Weight HOM 7f:4m Mixed Model framework, linear mixed-effects model, equation withoutWeight 0.615 Success
Slc25a29tm1a(KOMP)Wtsi WTSI IPGTT / Body Weight HOM 7f:4m Mixed Model framework, linear mixed-effects model, equation withoutWeight 0.615 Success
Slc25a29tm1a(KOMP)Wtsi WTSI IPGTT / Body Weight HOM 0f:3m Not processed 1.00 FAILED - Not enough mutant or control data
Slc25a29tm1a(KOMP)Wtsi WTSI IPGTT / Body Weight HOM 0f:3m Not processed 1.00 FAILED - Not enough mutant or control data
Slc25a29tm1a(KOMP)Wtsi WTSI Buffy coat peripheral blood leukocyte immunophenotyping / Granulocyte Gr1+ percentage HOM 7f:4m Mixed Model framework, linear mixed-effects model, equation withoutWeight 0.0110 Success
Slc25a29tm1a(KOMP)Wtsi WTSI Ophthalmoscope / Left Retina Structure HOM 7f:4m Fisher Exact Test framework 1.00 Not tested (No variation) - OK
Slc25a29tm1a(KOMP)Wtsi WTSI Ophthalmoscope / Left Retina Structure HOM 0f:3m - 1.00 FAILED - Not enough mutant or control data
Slc25a29tm1a(KOMP)Wtsi WTSI Ophthalmoscope / Left Retina Structure HOM 0f:3m - 1.00 FAILED - Not enough mutant or control data
Slc25a29tm1a(KOMP)Wtsi WTSI Ophthalmoscope / Left Retina Structure HOM 7f:4m Fisher Exact Test framework 1.00 Not tested (No variation) - OK
Slc25a29tm1a(KOMP)Wtsi WTSI Ophthalmoscope / Left Retina Pigmentation HOM 7f:4m Fisher Exact Test framework 0.0189 Success
Slc25a29tm1a(KOMP)Wtsi WTSI Ophthalmoscope / Left Retina Pigmentation HOM 7f:4m Fisher Exact Test framework 0.0189 Success
Slc25a29tm1a(KOMP)Wtsi WTSI Ophthalmoscope / Left Retina Pigmentation HOM 0f:3m - 1.00 FAILED - Not enough mutant or control data
Slc25a29tm1a(KOMP)Wtsi WTSI Ophthalmoscope / Left Retina Pigmentation HOM 0f:3m - 1.00 FAILED - Not enough mutant or control data
Slc25a29tm1a(KOMP)Wtsi WTSI Ophthalmoscope / Right Retina HOM 7f:4m Fisher Exact Test framework 0.00129 Success
Slc25a29tm1a(KOMP)Wtsi WTSI Ophthalmoscope / Right Retina HOM 7f:4m Fisher Exact Test framework 0.00129 Success
Slc25a29tm1a(KOMP)Wtsi WTSI Ophthalmoscope / Right Retina HOM 0f:3m - 1.00 FAILED - Not enough mutant or control data
Slc25a29tm1a(KOMP)Wtsi WTSI Ophthalmoscope / Right Retina HOM 0f:3m - 1.00 FAILED - Not enough mutant or control data
Slc25a29tm1a(KOMP)Wtsi WTSI Ophthalmoscope / Left Optic Disc HOM 7f:4m Fisher Exact Test framework 1.00 Success
Slc25a29tm1a(KOMP)Wtsi WTSI Ophthalmoscope / Left Optic Disc HOM 0f:3m - 1.00 FAILED - Not enough mutant or control data
Slc25a29tm1a(KOMP)Wtsi WTSI Ophthalmoscope / Left Optic Disc HOM 0f:3m - 1.00 FAILED - Not enough mutant or control data
Slc25a29tm1a(KOMP)Wtsi WTSI Ophthalmoscope / Left Optic Disc HOM 7f:4m Fisher Exact Test framework 1.00 Success
Slc25a29tm1a(KOMP)Wtsi WTSI Ophthalmoscope / Eye HOM 7f:4m Fisher Exact Test framework 0.0278 Success
Slc25a29tm1a(KOMP)Wtsi WTSI Ophthalmoscope / Eye HOM 7f:4m Fisher Exact Test framework 0.0278 Success
Slc25a29tm1a(KOMP)Wtsi WTSI Ophthalmoscope / Eye HOM 0f:3m - 1.00 FAILED - Not enough mutant or control data
Slc25a29tm1a(KOMP)Wtsi WTSI Ophthalmoscope / Eye HOM 0f:3m - 1.00 FAILED - Not enough mutant or control data
Slc25a29tm1a(KOMP)Wtsi WTSI Ophthalmoscope / Left Retina HOM 7f:4m Fisher Exact Test framework 0.0189 Success
Slc25a29tm1a(KOMP)Wtsi WTSI Ophthalmoscope / Left Retina HOM 7f:4m Fisher Exact Test framework 0.0189 Success
Slc25a29tm1a(KOMP)Wtsi WTSI Ophthalmoscope / Left Retina HOM 0f:3m - 1.00 FAILED - Not enough mutant or control data
Slc25a29tm1a(KOMP)Wtsi WTSI Ophthalmoscope / Left Retina HOM 0f:3m - 1.00 FAILED - Not enough mutant or control data
Slc25a29tm1a(KOMP)Wtsi WTSI Clinical Chemistry / Creatine kinase HOM 7f:4m Mixed Model framework, linear mixed-effects model, equation withoutWeight 0.255 Success
Slc25a29tm1a(KOMP)Wtsi WTSI Clinical Chemistry / Creatine kinase HOM 7f:4m Mixed Model framework, linear mixed-effects model, equation withoutWeight 0.255 Success
Slc25a29tm1a(KOMP)Wtsi WTSI Clinical Chemistry / Creatine kinase HOM 0f:3m Not processed 1.00 FAILED - Not enough mutant or control data
Slc25a29tm1a(KOMP)Wtsi WTSI Clinical Chemistry / Creatine kinase HOM 0f:3m Not processed 1.00 FAILED - Not enough mutant or control data
Slc25a29tm1a(KOMP)Wtsi WTSI Ophthalmoscope / Right Retina Structure HOM 7f:4m Fisher Exact Test framework 1.00 Not tested (No variation) - OK
Slc25a29tm1a(KOMP)Wtsi WTSI Ophthalmoscope / Right Retina Structure HOM 0f:3m - 1.00 FAILED - Not enough mutant or control data
Slc25a29tm1a(KOMP)Wtsi WTSI Ophthalmoscope / Right Retina Structure HOM 0f:3m - 1.00 FAILED - Not enough mutant or control data
Slc25a29tm1a(KOMP)Wtsi WTSI Ophthalmoscope / Right Retina Structure HOM 7f:4m Fisher Exact Test framework 1.00 Not tested (No variation) - OK
Slc25a29tm1a(KOMP)Wtsi WTSI Ophthalmoscope / Right Retina Pigmentation HOM 7f:4m Fisher Exact Test framework 0.00129 Success
Slc25a29tm1a(KOMP)Wtsi WTSI Ophthalmoscope / Right Retina Pigmentation HOM 7f:4m Fisher Exact Test framework 0.00129 Success
Slc25a29tm1a(KOMP)Wtsi WTSI Ophthalmoscope / Right Retina Pigmentation HOM 0f:3m - 1.00 FAILED - Not enough mutant or control data
Slc25a29tm1a(KOMP)Wtsi WTSI Ophthalmoscope / Right Retina Pigmentation HOM 0f:3m - 1.00 FAILED - Not enough mutant or control data
Slc25a29tm1a(KOMP)Wtsi WTSI Clinical Chemistry / Total cholesterol HOM 7f:4m Mixed Model framework, linear mixed-effects model, equation withoutWeight 0.328 Success
Slc25a29tm1a(KOMP)Wtsi WTSI Clinical Chemistry / Total cholesterol HOM 7f:4m Mixed Model framework, linear mixed-effects model, equation withoutWeight 0.328 Success
Slc25a29tm1a(KOMP)Wtsi WTSI Clinical Chemistry / Total cholesterol HOM 0f:3m Not processed 1.00 FAILED - Not enough mutant or control data
Slc25a29tm1a(KOMP)Wtsi WTSI Clinical Chemistry / Total cholesterol HOM 0f:3m Not processed 1.00 FAILED - Not enough mutant or control data
Slc25a29tm1a(KOMP)Wtsi WTSI Clinical Chemistry / Alpha-amylase HOM 7f:4m Mixed Model framework, linear mixed-effects model, equation withoutWeight 0.478 Success
Slc25a29tm1a(KOMP)Wtsi WTSI Clinical Chemistry / Alpha-amylase HOM 7f:4m Mixed Model framework, linear mixed-effects model, equation withoutWeight 0.478 Success
Slc25a29tm1a(KOMP)Wtsi WTSI Clinical Chemistry / Alpha-amylase HOM 0f:3m Not processed 1.00 FAILED - Not enough mutant or control data
Slc25a29tm1a(KOMP)Wtsi WTSI Clinical Chemistry / Alpha-amylase HOM 0f:3m Not processed 1.00 FAILED - Not enough mutant or control data
Slc25a29tm1a(KOMP)Wtsi WTSI Clinical Chemistry / Alkaline phosphatase HOM 7f:4m Mixed Model framework, linear mixed-effects model, equation withoutWeight 0.969 Success
Slc25a29tm1a(KOMP)Wtsi WTSI Clinical Chemistry / Alkaline phosphatase HOM 7f:4m Mixed Model framework, linear mixed-effects model, equation withoutWeight 0.969 Success
Slc25a29tm1a(KOMP)Wtsi WTSI Clinical Chemistry / Alkaline phosphatase HOM 0f:3m Not processed 1.00 FAILED - Not enough mutant or control data
Slc25a29tm1a(KOMP)Wtsi WTSI Clinical Chemistry / Alkaline phosphatase HOM 0f:3m Not processed 1.00 FAILED - Not enough mutant or control data
Slc25a29tm1a(KOMP)Wtsi WTSI Clinical Chemistry / Alanine aminotransferase HOM 7f:4m Mixed Model framework, linear mixed-effects model, equation withoutWeight 0.465 Success
Slc25a29tm1a(KOMP)Wtsi WTSI Clinical Chemistry / Alanine aminotransferase HOM 7f:4m Mixed Model framework, linear mixed-effects model, equation withoutWeight 0.465 Success
Slc25a29tm1a(KOMP)Wtsi WTSI Clinical Chemistry / Alanine aminotransferase HOM 0f:3m Not processed 1.00 FAILED - Not enough mutant or control data
Slc25a29tm1a(KOMP)Wtsi WTSI Clinical Chemistry / Alanine aminotransferase HOM 0f:3m Not processed 1.00 FAILED - Not enough mutant or control data
Slc25a29tm1a(KOMP)Wtsi WTSI Clinical Chemistry / Aspartate aminotransferase HOM 7f:4m Mixed Model framework, linear mixed-effects model, equation withoutWeight 0.277 Success
Slc25a29tm1a(KOMP)Wtsi WTSI Clinical Chemistry / Aspartate aminotransferase HOM 7f:4m Mixed Model framework, linear mixed-effects model, equation withoutWeight 0.277 Success
Slc25a29tm1a(KOMP)Wtsi WTSI Clinical Chemistry / Aspartate aminotransferase HOM 0f:3m Not processed 1.00 FAILED - Not enough mutant or control data
Slc25a29tm1a(KOMP)Wtsi WTSI Clinical Chemistry / Aspartate aminotransferase HOM 0f:3m Not processed 1.00 FAILED - Not enough mutant or control data
Slc25a29tm1a(KOMP)Wtsi WTSI Body Weight / Body Weight HOM 30f:20m Mixed Model framework, linear mixed-effects model, equation withoutWeight 0.00124 Success
Slc25a29tm1a(KOMP)Wtsi WTSI Body Weight / Body Weight HOM 30f:20m Mixed Model framework, linear mixed-effects model, equation withoutWeight 0.00124 Success
Slc25a29tm1a(KOMP)Wtsi WTSI Body Weight / Body Weight HOM 0f:19m Mixed Model framework, linear mixed-effects model, equation withoutWeight 0.100 Success
Slc25a29tm1a(KOMP)Wtsi WTSI Body Weight / Body Weight HOM 0f:19m Mixed Model framework, linear mixed-effects model, equation withoutWeight 0.100 Success
Slc25a29tm1a(KOMP)Wtsi WTSI Clinical Chemistry / Lactate dehydrogenase HOM 7f:4m Mixed Model framework, generalized least squares, equation withoutWeight 0.293 Success
Slc25a29tm1a(KOMP)Wtsi WTSI Clinical Chemistry / Lactate dehydrogenase HOM 7f:4m Mixed Model framework, generalized least squares, equation withoutWeight 0.293 Success
Slc25a29tm1a(KOMP)Wtsi WTSI Clinical Chemistry / Lactate dehydrogenase HOM 0f:3m Not processed 1.00 FAILED - Not enough mutant or control data
Slc25a29tm1a(KOMP)Wtsi WTSI Clinical Chemistry / Lactate dehydrogenase HOM 0f:3m Not processed 1.00 FAILED - Not enough mutant or control data
Slc25a29tm1a(KOMP)Wtsi WTSI Clinical Chemistry / Iron HOM 7f:4m Mixed Model framework, linear mixed-effects model, equation withoutWeight 0.990 Success
Slc25a29tm1a(KOMP)Wtsi WTSI Clinical Chemistry / Iron HOM 7f:4m Mixed Model framework, linear mixed-effects model, equation withoutWeight 0.990 Success
Slc25a29tm1a(KOMP)Wtsi WTSI Clinical Chemistry / Iron HOM 0f:3m Not processed 1.00 FAILED - Not enough mutant or control data
Slc25a29tm1a(KOMP)Wtsi WTSI Clinical Chemistry / Iron HOM 0f:3m Not processed 1.00 FAILED - Not enough mutant or control data
Slc25a29tm1a(KOMP)Wtsi WTSI Clinical Chemistry / Phosphorus HOM 7f:4m Mixed Model framework, linear mixed-effects model, equation withoutWeight 0.524 Success
Slc25a29tm1a(KOMP)Wtsi WTSI Clinical Chemistry / Phosphorus HOM 7f:4m Mixed Model framework, linear mixed-effects model, equation withoutWeight 0.524 Success
Slc25a29tm1a(KOMP)Wtsi WTSI Clinical Chemistry / Phosphorus HOM 0f:3m Not processed 1.00 FAILED - Not enough mutant or control data
Slc25a29tm1a(KOMP)Wtsi WTSI Clinical Chemistry / Phosphorus HOM 0f:3m Not processed 1.00 FAILED - Not enough mutant or control data
Slc25a29tm1a(KOMP)Wtsi WTSI Buffy coat peripheral blood leukocyte immunophenotyping / T cell CD3+ percentage HOM 7f:4m Mixed Model framework, linear mixed-effects model, equation withoutWeight 0.824 Success
Slc25a29tm1a(KOMP)Wtsi WTSI Ophthalmoscope / Right Optic Disc HOM 7f:4m Fisher Exact Test framework 1.00 Not tested (No variation) - OK
Slc25a29tm1a(KOMP)Wtsi WTSI Ophthalmoscope / Right Optic Disc HOM 0f:3m - 1.00 FAILED - Not enough mutant or control data
Slc25a29tm1a(KOMP)Wtsi WTSI Ophthalmoscope / Right Optic Disc HOM 0f:3m - 1.00 FAILED - Not enough mutant or control data
Slc25a29tm1a(KOMP)Wtsi WTSI Ophthalmoscope / Right Optic Disc HOM 7f:4m Fisher Exact Test framework 1.00 Not tested (No variation) - OK
Slc25a29tm1a(KOMP)Wtsi WTSI Clinical Chemistry / Free fatty acid HOM 7f:4m Mixed Model framework, linear mixed-effects model, equation withoutWeight 0.747 Success
Slc25a29tm1a(KOMP)Wtsi WTSI Clinical Chemistry / Free fatty acid HOM 7f:4m Mixed Model framework, linear mixed-effects model, equation withoutWeight 0.747 Success
Slc25a29tm1a(KOMP)Wtsi WTSI Clinical Chemistry / Free fatty acid HOM 0f:3m Not processed 1.00 FAILED - Not enough mutant or control data
Slc25a29tm1a(KOMP)Wtsi WTSI Clinical Chemistry / Free fatty acid HOM 0f:3m Not processed 1.00 FAILED - Not enough mutant or control data
Slc25a29tm1a(KOMP)Wtsi WTSI Clinical Chemistry / Triglyceride HOM 7f:4m Mixed Model framework, linear mixed-effects model, equation withoutWeight 0.790 Success
Slc25a29tm1a(KOMP)Wtsi WTSI Clinical Chemistry / Triglyceride HOM 7f:4m Mixed Model framework, linear mixed-effects model, equation withoutWeight 0.790 Success
Slc25a29tm1a(KOMP)Wtsi WTSI Clinical Chemistry / Triglyceride HOM 0f:3m Not processed 1.00 FAILED - Not enough mutant or control data
Slc25a29tm1a(KOMP)Wtsi WTSI Clinical Chemistry / Triglyceride HOM 0f:3m Not processed 1.00 FAILED - Not enough mutant or control data
Slc25a29tm1a(KOMP)Wtsi WTSI Ophthalmoscope / Right Eye Blood Vessels Pattern HOM 7f:4m Fisher Exact Test framework 1.00 Not tested (No variation) - OK
Slc25a29tm1a(KOMP)Wtsi WTSI Ophthalmoscope / Right Eye Blood Vessels Pattern HOM 0f:3m - 1.00 FAILED - Not enough mutant or control data
Slc25a29tm1a(KOMP)Wtsi WTSI Ophthalmoscope / Right Eye Blood Vessels Pattern HOM 0f:3m - 1.00 FAILED - Not enough mutant or control data
Slc25a29tm1a(KOMP)Wtsi WTSI Ophthalmoscope / Right Eye Blood Vessels Pattern HOM 7f:4m Fisher Exact Test framework 1.00 Not tested (No variation) - OK
Slc25a29tm1a(KOMP)Wtsi WTSI Ophthalmoscope / Right Eye Blood Vessels Structure HOM 0f:3m - 1.00 FAILED - Not enough mutant or control data
Slc25a29tm1a(KOMP)Wtsi WTSI Ophthalmoscope / Right Eye Blood Vessels Structure HOM 7f:4m Fisher Exact Test framework 1.00 Not tested (No variation) - OK
Slc25a29tm1a(KOMP)Wtsi WTSI Ophthalmoscope / Right Eye Blood Vessels Structure HOM 0f:3m - 1.00 FAILED - Not enough mutant or control data
Slc25a29tm1a(KOMP)Wtsi WTSI Ophthalmoscope / Right Eye Blood Vessels Structure HOM 7f:4m Fisher Exact Test framework 1.00 Not tested (No variation) - OK
Slc25a29tm1a(KOMP)Wtsi WTSI Ophthalmoscope / Body Weight HOM 7f:4m Mixed Model framework, linear mixed-effects model, equation withoutWeight 0.394 Success
Slc25a29tm1a(KOMP)Wtsi WTSI Ophthalmoscope / Body Weight HOM 7f:4m Mixed Model framework, linear mixed-effects model, equation withoutWeight 0.394 Success
Slc25a29tm1a(KOMP)Wtsi WTSI Ophthalmoscope / Body Weight HOM 0f:3m Not processed 1.00 FAILED - Not enough mutant or control data
Slc25a29tm1a(KOMP)Wtsi WTSI Ophthalmoscope / Body Weight HOM 0f:3m Not processed 1.00 FAILED - Not enough mutant or control data
Slc25a29tm1a(KOMP)Wtsi WTSI Ophthalmoscope / Left Eye Blood Vessels Structure HOM 7f:4m Fisher Exact Test framework 1.00 Not tested (No variation) - OK
Slc25a29tm1a(KOMP)Wtsi WTSI Ophthalmoscope / Left Eye Blood Vessels Structure HOM 0f:3m - 1.00 FAILED - Not enough mutant or control data
Slc25a29tm1a(KOMP)Wtsi WTSI Ophthalmoscope / Left Eye Blood Vessels Structure HOM 7f:4m Fisher Exact Test framework 1.00 Not tested (No variation) - OK
Slc25a29tm1a(KOMP)Wtsi WTSI Ophthalmoscope / Left Eye Blood Vessels Structure HOM 0f:3m - 1.00 FAILED - Not enough mutant or control data
Slc25a29tm1a(KOMP)Wtsi WTSI Ophthalmoscope / Left Eye Blood Vessels HOM 0f:3m - 1.00 FAILED - Not enough mutant or control data
Slc25a29tm1a(KOMP)Wtsi WTSI Ophthalmoscope / Left Eye Blood Vessels HOM 7f:4m Fisher Exact Test framework 1.00 Not tested (No variation) - OK
Slc25a29tm1a(KOMP)Wtsi WTSI Ophthalmoscope / Left Eye Blood Vessels HOM 7f:4m Fisher Exact Test framework 1.00 Not tested (No variation) - OK
Slc25a29tm1a(KOMP)Wtsi WTSI Ophthalmoscope / Left Eye Blood Vessels HOM 0f:3m - 1.00 FAILED - Not enough mutant or control data
Slc25a29tm1a(KOMP)Wtsi WTSI Ophthalmoscope / Right Eye Blood Vessels HOM 7f:4m Fisher Exact Test framework 1.00 Not tested (No variation) - OK
Slc25a29tm1a(KOMP)Wtsi WTSI Ophthalmoscope / Right Eye Blood Vessels HOM 0f:3m - 1.00 FAILED - Not enough mutant or control data
Slc25a29tm1a(KOMP)Wtsi WTSI Ophthalmoscope / Right Eye Blood Vessels HOM 7f:4m Fisher Exact Test framework 1.00 Not tested (No variation) - OK
Slc25a29tm1a(KOMP)Wtsi WTSI Ophthalmoscope / Right Eye Blood Vessels HOM 0f:3m - 1.00 FAILED - Not enough mutant or control data
Slc25a29tm1a(KOMP)Wtsi WTSI Ophthalmoscope / Left Eye Blood Vessels Pattern HOM 7f:4m Fisher Exact Test framework 1.00 Not tested (No variation) - OK
Slc25a29tm1a(KOMP)Wtsi WTSI Ophthalmoscope / Left Eye Blood Vessels Pattern HOM 0f:3m - 1.00 FAILED - Not enough mutant or control data
Slc25a29tm1a(KOMP)Wtsi WTSI Ophthalmoscope / Left Eye Blood Vessels Pattern HOM 0f:3m - 1.00 FAILED - Not enough mutant or control data
Slc25a29tm1a(KOMP)Wtsi WTSI Ophthalmoscope / Left Eye Blood Vessels Pattern HOM 7f:4m Fisher Exact Test framework 1.00 Not tested (No variation) - OK
Slc25a29tm1a(KOMP)Wtsi WTSI Clinical Chemistry / Magnesium HOM 7f:4m Mixed Model framework, linear mixed-effects model, equation withoutWeight 0.245 Success
Slc25a29tm1a(KOMP)Wtsi WTSI Clinical Chemistry / Magnesium HOM 7f:4m Mixed Model framework, linear mixed-effects model, equation withoutWeight 0.245 Success
Slc25a29tm1a(KOMP)Wtsi WTSI Clinical Chemistry / Magnesium HOM 0f:3m Not processed 1.00 FAILED - Not enough mutant or control data
Slc25a29tm1a(KOMP)Wtsi WTSI Clinical Chemistry / Magnesium HOM 0f:3m Not processed 1.00 FAILED - Not enough mutant or control data
Slc25a29tm1a(KOMP)Wtsi WTSI Fertility of Homozygous Knock-out Mice / Gross Findings Male HOM f:m Supplied as data Success
Slc25a29tm1a(KOMP)Wtsi WTSI Clinical Chemistry / Fructosamine HOM 7f:4m Mixed Model framework, linear mixed-effects model, equation withoutWeight 0.509 Success
Slc25a29tm1a(KOMP)Wtsi WTSI Clinical Chemistry / Fructosamine HOM 7f:4m Mixed Model framework, linear mixed-effects model, equation withoutWeight 0.509 Success
Slc25a29tm1a(KOMP)Wtsi WTSI Clinical Chemistry / Fructosamine HOM 0f:3m Not processed 1.00 FAILED - Not enough mutant or control data
Slc25a29tm1a(KOMP)Wtsi WTSI Clinical Chemistry / Fructosamine HOM 0f:3m Not processed 1.00 FAILED - Not enough mutant or control data
Slc25a29tm1a(KOMP)Wtsi WTSI Clinical Chemistry / C-Reactive protein HOM 0f:3m Not processed 1.00 FAILED - Not enough mutant or control data
Slc25a29tm1a(KOMP)Wtsi WTSI Clinical Chemistry / C-Reactive protein HOM 0f:3m Not processed 1.00 FAILED - Not enough mutant or control data
Slc25a29tm1a(KOMP)Wtsi WTSI Clinical Chemistry / Transferrin HOM 0f:3m Not processed 1.00 FAILED - Not enough mutant or control data
Slc25a29tm1a(KOMP)Wtsi WTSI Clinical Chemistry / Transferrin HOM 0f:3m Not processed 1.00 FAILED - Not enough mutant or control data
Slc25a29tm1a(KOMP)Wtsi WTSI Clinical Chemistry / Ferretin HOM 0f:3m Not processed 1.00 FAILED - Not enough mutant or control data
Slc25a29tm1a(KOMP)Wtsi WTSI Clinical Chemistry / Ferretin HOM 0f:3m Not processed 1.00 FAILED - Not enough mutant or control data
Slc25a29tm1a(KOMP)Wtsi WTSI Clinical Chemistry / LDL-cholesterol HOM 7f:4m Mixed Model framework, linear mixed-effects model, equation withoutWeight 0.621 Success
Slc25a29tm1a(KOMP)Wtsi WTSI Clinical Chemistry / LDL-cholesterol HOM 7f:4m Mixed Model framework, linear mixed-effects model, equation withoutWeight 0.621 Success
Slc25a29tm1a(KOMP)Wtsi WTSI Clinical Chemistry / LDL-cholesterol HOM 0f:3m Not processed 1.00 FAILED - Not enough mutant or control data
Slc25a29tm1a(KOMP)Wtsi WTSI Clinical Chemistry / LDL-cholesterol HOM 0f:3m Not processed 1.00 FAILED - Not enough mutant or control data
Slc25a29tm1a(KOMP)Wtsi WTSI Clinical Chemistry / HDL-cholesterol HOM 7f:4m Mixed Model framework, linear mixed-effects model, equation withoutWeight 0.336 Success
Slc25a29tm1a(KOMP)Wtsi WTSI Clinical Chemistry / HDL-cholesterol HOM 7f:4m Mixed Model framework, linear mixed-effects model, equation withoutWeight 0.336 Success
Slc25a29tm1a(KOMP)Wtsi WTSI Clinical Chemistry / HDL-cholesterol HOM 0f:3m Not processed 1.00 FAILED - Not enough mutant or control data
Slc25a29tm1a(KOMP)Wtsi WTSI Clinical Chemistry / HDL-cholesterol HOM 0f:3m Not processed 1.00 FAILED - Not enough mutant or control data
Slc25a29tm1a(KOMP)Wtsi WTSI Clinical Chemistry / Total bilirubin HOM 7f:4m Mixed Model framework, linear mixed-effects model, equation withoutWeight 0.682 Success
Slc25a29tm1a(KOMP)Wtsi WTSI Clinical Chemistry / Total bilirubin HOM 7f:4m Mixed Model framework, linear mixed-effects model, equation withoutWeight 0.682 Success
Slc25a29tm1a(KOMP)Wtsi WTSI Clinical Chemistry / Total bilirubin HOM 0f:3m Not processed 1.00 FAILED - Not enough mutant or control data
Slc25a29tm1a(KOMP)Wtsi WTSI Clinical Chemistry / Total bilirubin HOM 0f:3m Not processed 1.00 FAILED - Not enough mutant or control data
Slc25a29tm1a(KOMP)Wtsi WTSI Clinical Chemistry / Uric acid HOM 7f:4m Mixed Model framework, generalized least squares, equation withoutWeight 0.364 Success
Slc25a29tm1a(KOMP)Wtsi WTSI Clinical Chemistry / Uric acid HOM 7f:4m Mixed Model framework, generalized least squares, equation withoutWeight 0.364 Success
Slc25a29tm1a(KOMP)Wtsi WTSI Clinical Chemistry / Uric acid HOM 0f:3m Not processed 1.00 FAILED - Not enough mutant or control data
Slc25a29tm1a(KOMP)Wtsi WTSI Clinical Chemistry / Uric acid HOM 0f:3m Not processed 1.00 FAILED - Not enough mutant or control data
Slc25a29tm1a(KOMP)Wtsi WTSI Grip Strength / Body weight HOM 7f:4m Mixed Model framework, linear mixed-effects model, equation withoutWeight 0.756 Success
Slc25a29tm1a(KOMP)Wtsi WTSI Grip Strength / Body weight HOM 7f:4m Mixed Model framework, linear mixed-effects model, equation withoutWeight 0.756 Success
Slc25a29tm1a(KOMP)Wtsi WTSI Grip Strength / Body weight HOM 0f:3m Not processed 1.00 FAILED - Not enough mutant or control data
Slc25a29tm1a(KOMP)Wtsi WTSI Grip Strength / Body weight HOM 0f:3m Not processed 1.00 FAILED - Not enough mutant or control data
Slc25a29tm1a(KOMP)Wtsi WTSI Clinical Chemistry / Glycerol HOM 7f:4m Mixed Model framework, linear mixed-effects model, equation withoutWeight 0.869 Success
Slc25a29tm1a(KOMP)Wtsi WTSI Clinical Chemistry / Glycerol HOM 7f:4m Mixed Model framework, linear mixed-effects model, equation withoutWeight 0.869 Success
Slc25a29tm1a(KOMP)Wtsi WTSI Clinical Chemistry / Glycerol HOM 0f:3m Not processed 1.00 FAILED - Not enough mutant or control data
Slc25a29tm1a(KOMP)Wtsi WTSI Clinical Chemistry / Glycerol HOM 0f:3m Not processed 1.00 FAILED - Not enough mutant or control data
Slc25a29tm1a(KOMP)Wtsi WTSI Hot Plate / Time of first response HOM 7f:4m Mixed Model framework, linear mixed-effects model, equation withoutWeight 0.490 Success
Slc25a29tm1a(KOMP)Wtsi WTSI Hot Plate / Time of first response HOM 7f:4m Mixed Model framework, linear mixed-effects model, equation withoutWeight 0.490 Success
Slc25a29tm1a(KOMP)Wtsi WTSI Hot Plate / Time of first response HOM 0f:3m Not processed 1.00 FAILED - Not enough mutant or control data
Slc25a29tm1a(KOMP)Wtsi WTSI Hot Plate / Time of first response HOM 0f:3m Not processed 1.00 FAILED - Not enough mutant or control data
Slc25a29tm1a(KOMP)Wtsi WTSI Hot Plate / Body Weight HOM 7f:4m Mixed Model framework, linear mixed-effects model, equation withoutWeight 0.908 Success
Slc25a29tm1a(KOMP)Wtsi WTSI Hot Plate / Body Weight HOM 7f:4m Mixed Model framework, linear mixed-effects model, equation withoutWeight 0.908 Success
Slc25a29tm1a(KOMP)Wtsi WTSI Hot Plate / Body Weight HOM 0f:3m Not processed 1.00 FAILED - Not enough mutant or control data
Slc25a29tm1a(KOMP)Wtsi WTSI Hot Plate / Body Weight HOM 0f:3m Not processed 1.00 FAILED - Not enough mutant or control data
Slc25a29tm1a(KOMP)Wtsi WTSI Dysmorphology / Eye colouration HOM 7f:4m Fisher Exact Test framework 1.00 Success
Slc25a29tm1a(KOMP)Wtsi WTSI Dysmorphology / Eye colouration HOM 0f:3m - 1.00 FAILED - Not enough mutant or control data
Slc25a29tm1a(KOMP)Wtsi WTSI Dysmorphology / Eye colouration HOM 0f:3m - 1.00 FAILED - Not enough mutant or control data
Slc25a29tm1a(KOMP)Wtsi WTSI Dysmorphology / Eye colouration HOM 7f:4m Fisher Exact Test framework 1.00 Success
Slc25a29tm1a(KOMP)Wtsi WTSI Buffy coat peripheral blood leukocyte immunophenotyping / NKT cell percentage HOM 7f:4m Mixed Model framework, linear mixed-effects model, equation withoutWeight 0.0855 Success
Slc25a29tm1a(KOMP)Wtsi WTSI Dysmorphology / Eye size HOM 0f:3m - 1.00 FAILED - Not enough mutant or control data
Slc25a29tm1a(KOMP)Wtsi WTSI Dysmorphology / Eye size HOM 0f:3m - 1.00 FAILED - Not enough mutant or control data
Slc25a29tm1a(KOMP)Wtsi WTSI Dysmorphology / Eye size HOM 7f:4m Fisher Exact Test framework 1.00 Success
Slc25a29tm1a(KOMP)Wtsi WTSI Dysmorphology / Eye size HOM 7f:4m Fisher Exact Test framework 1.00 Success
Slc25a29tm1a(KOMP)Wtsi WTSI Dysmorphology / Eyes HOM 0f:3m - 1.00 FAILED - Not enough mutant or control data
Slc25a29tm1a(KOMP)Wtsi WTSI Dysmorphology / Eyes HOM 0f:3m - 1.00 FAILED - Not enough mutant or control data
Slc25a29tm1a(KOMP)Wtsi WTSI Dysmorphology / Eyes HOM 7f:4m Fisher Exact Test framework 1.00 Success
Slc25a29tm1a(KOMP)Wtsi WTSI Dysmorphology / Eyes HOM 7f:4m Fisher Exact Test framework 1.00 Success
Slc25a29tm1a(KOMP)Wtsi WTSI Indirect Calorimetry / Body mass after experiment HOM 7f:4m Mixed Model framework, linear mixed-effects model, equation withoutWeight 0.887 Success
Slc25a29tm1a(KOMP)Wtsi WTSI Indirect Calorimetry / Body mass after experiment HOM 7f:4m Mixed Model framework, linear mixed-effects model, equation withoutWeight 0.887 Success
Slc25a29tm1a(KOMP)Wtsi WTSI Indirect Calorimetry / Body mass after experiment HOM 0f:3m Not processed 1.00 FAILED - Not enough mutant or control data
Slc25a29tm1a(KOMP)Wtsi WTSI Indirect Calorimetry / Body mass after experiment HOM 0f:3m Not processed 1.00 FAILED - Not enough mutant or control data
Slc25a29tm1a(KOMP)Wtsi WTSI Dysmorphology / Incisor HOM 7f:4m Fisher Exact Test framework 1.00 Success
Slc25a29tm1a(KOMP)Wtsi WTSI Dysmorphology / Incisor HOM 0f:3m - 1.00 FAILED - Not enough mutant or control data
Slc25a29tm1a(KOMP)Wtsi WTSI Dysmorphology / Incisor HOM 0f:3m - 1.00 FAILED - Not enough mutant or control data
Slc25a29tm1a(KOMP)Wtsi WTSI Dysmorphology / Incisor HOM 7f:4m Fisher Exact Test framework 1.00 Success
Slc25a29tm1a(KOMP)Wtsi WTSI Indirect Calorimetry / Body mass before experiment HOM 7f:4m Mixed Model framework, linear mixed-effects model, equation withoutWeight 0.798 Success
Slc25a29tm1a(KOMP)Wtsi WTSI Indirect Calorimetry / Body mass before experiment HOM 7f:4m Mixed Model framework, linear mixed-effects model, equation withoutWeight 0.798 Success
Slc25a29tm1a(KOMP)Wtsi WTSI Indirect Calorimetry / Body mass before experiment HOM 0f:3m Not processed 1.00 FAILED - Not enough mutant or control data
Slc25a29tm1a(KOMP)Wtsi WTSI Indirect Calorimetry / Body mass before experiment HOM 0f:3m Not processed 1.00 FAILED - Not enough mutant or control data
Slc25a29tm1a(KOMP)Wtsi WTSI Dysmorphology / Snout morphology HOM 0f:3m - 1.00 FAILED - Not enough mutant or control data
Slc25a29tm1a(KOMP)Wtsi WTSI Dysmorphology / Snout morphology HOM 0f:3m - 1.00 FAILED - Not enough mutant or control data
Slc25a29tm1a(KOMP)Wtsi WTSI Dysmorphology / Snout morphology HOM 7f:4m Fisher Exact Test framework 1.00 Success
Slc25a29tm1a(KOMP)Wtsi WTSI Dysmorphology / Snout morphology HOM 7f:4m Fisher Exact Test framework 1.00 Success
Slc25a29tm1a(KOMP)Wtsi WTSI Dysmorphology / Mouth morphology HOM 0f:3m - 1.00 FAILED - Not enough mutant or control data
Slc25a29tm1a(KOMP)Wtsi WTSI Dysmorphology / Mouth morphology HOM 0f:3m - 1.00 FAILED - Not enough mutant or control data
Slc25a29tm1a(KOMP)Wtsi WTSI Dysmorphology / Mouth morphology HOM 7f:4m Fisher Exact Test framework 1.00 Not tested (No variation) - OK
Slc25a29tm1a(KOMP)Wtsi WTSI Dysmorphology / Mouth morphology HOM 7f:4m Fisher Exact Test framework 1.00 Not tested (No variation) - OK
Slc25a29tm1a(KOMP)Wtsi WTSI Dysmorphology / Ear size HOM 7f:4m Fisher Exact Test framework 1.00 Not tested (No variation) - OK
Slc25a29tm1a(KOMP)Wtsi WTSI Dysmorphology / Ear size HOM 7f:4m Fisher Exact Test framework 1.00 Not tested (No variation) - OK
Slc25a29tm1a(KOMP)Wtsi WTSI Dysmorphology / Ear size HOM 0f:3m - 1.00 FAILED - Not enough mutant or control data
Slc25a29tm1a(KOMP)Wtsi WTSI Dysmorphology / Ear size HOM 0f:3m - 1.00 FAILED - Not enough mutant or control data
Slc25a29tm1a(KOMP)Wtsi WTSI Dysmorphology / Ear morphology HOM 7f:4m Fisher Exact Test framework 1.00 Not tested (No variation) - OK
Slc25a29tm1a(KOMP)Wtsi WTSI Dysmorphology / Ear morphology HOM 0f:3m - 1.00 FAILED - Not enough mutant or control data
Slc25a29tm1a(KOMP)Wtsi WTSI Dysmorphology / Ear morphology HOM 0f:3m - 1.00 FAILED - Not enough mutant or control data
Slc25a29tm1a(KOMP)Wtsi WTSI Dysmorphology / Ear morphology HOM 7f:4m Fisher Exact Test framework 1.00 Not tested (No variation) - OK
Slc25a29tm1a(KOMP)Wtsi WTSI Dysmorphology / Whiskers HOM 7f:4m Fisher Exact Test framework 0.223 Success
Slc25a29tm1a(KOMP)Wtsi WTSI Dysmorphology / Whiskers HOM 7f:4m Fisher Exact Test framework 0.223 Success
Slc25a29tm1a(KOMP)Wtsi WTSI Dysmorphology / Whiskers HOM 0f:3m - 1.00 FAILED - Not enough mutant or control data
Slc25a29tm1a(KOMP)Wtsi WTSI Dysmorphology / Whiskers HOM 0f:3m - 1.00 FAILED - Not enough mutant or control data
Slc25a29tm1a(KOMP)Wtsi WTSI Dysmorphology / Incisor colour HOM 7f:4m Fisher Exact Test framework 1.00 Not tested (No variation) - OK
Slc25a29tm1a(KOMP)Wtsi WTSI Dysmorphology / Incisor colour HOM 0f:3m - 1.00 FAILED - Not enough mutant or control data
Slc25a29tm1a(KOMP)Wtsi WTSI Dysmorphology / Incisor colour HOM 0f:3m - 1.00 FAILED - Not enough mutant or control data
Slc25a29tm1a(KOMP)Wtsi WTSI Dysmorphology / Incisor colour HOM 7f:4m Fisher Exact Test framework 1.00 Not tested (No variation) - OK
Slc25a29tm1a(KOMP)Wtsi WTSI X-ray / Shape of femur HOM 0f:3m - 1.00 FAILED - Not enough mutant or control data
Slc25a29tm1a(KOMP)Wtsi WTSI X-ray / Shape of femur HOM 0f:3m - 1.00 FAILED - Not enough mutant or control data
Slc25a29tm1a(KOMP)Wtsi WTSI X-ray / Shape of femur HOM 7f:4m Fisher Exact Test framework 1.00 Success
Slc25a29tm1a(KOMP)Wtsi WTSI X-ray / Shape of femur HOM 7f:4m Fisher Exact Test framework 1.00 Success
Slc25a29tm1a(KOMP)Wtsi WTSI X-ray / Number of digits HOM 0f:3m Not processed 1.00 FAILED - Not enough mutant or control data
Slc25a29tm1a(KOMP)Wtsi WTSI X-ray / Number of digits HOM 0f:3m Not processed 1.00 FAILED - Not enough mutant or control data
Slc25a29tm1a(KOMP)Wtsi WTSI X-ray / Number of digits HOM 7f:4m Not processed 1.00 FAILED - No variability in dependent variable 'M.G.P_006_001_004'.
Slc25a29tm1a(KOMP)Wtsi WTSI X-ray / Number of digits HOM 7f:4m Not processed 1.00 FAILED - No variability in dependent variable 'M.G.P_006_001_004'.
Slc25a29tm1a(KOMP)Wtsi WTSI X-ray / Shape of humerus HOM 0f:3m - 1.00 FAILED - Not enough mutant or control data
Slc25a29tm1a(KOMP)Wtsi WTSI X-ray / Shape of humerus HOM 0f:3m - 1.00 FAILED - Not enough mutant or control data
Slc25a29tm1a(KOMP)Wtsi WTSI X-ray / Shape of humerus HOM 7f:4m Fisher Exact Test framework 1.00 Not tested (No variation) - OK
Slc25a29tm1a(KOMP)Wtsi WTSI X-ray / Shape of humerus HOM 7f:4m Fisher Exact Test framework 1.00 Not tested (No variation) - OK
Slc25a29tm1a(KOMP)Wtsi WTSI X-ray / Fibula HOM 0f:3m - 1.00 FAILED - Not enough mutant or control data
Slc25a29tm1a(KOMP)Wtsi WTSI X-ray / Fibula HOM 0f:3m - 1.00 FAILED - Not enough mutant or control data
Slc25a29tm1a(KOMP)Wtsi WTSI X-ray / Fibula HOM 7f:4m Fisher Exact Test framework 1.00 Not tested (No variation) - OK
Slc25a29tm1a(KOMP)Wtsi WTSI X-ray / Fibula HOM 7f:4m Fisher Exact Test framework 1.00 Not tested (No variation) - OK
Slc25a29tm1a(KOMP)Wtsi WTSI X-ray / Mandibles HOM 0f:3m - 1.00 FAILED - Not enough mutant or control data
Slc25a29tm1a(KOMP)Wtsi WTSI X-ray / Mandibles HOM 0f:3m - 1.00 FAILED - Not enough mutant or control data
Slc25a29tm1a(KOMP)Wtsi WTSI X-ray / Mandibles HOM 6f:4m Fisher Exact Test framework 1.00 Not tested (No variation) - OK
Slc25a29tm1a(KOMP)Wtsi WTSI X-ray / Mandibles HOM 6f:4m Fisher Exact Test framework 1.00 Not tested (No variation) - OK
Slc25a29tm1a(KOMP)Wtsi WTSI Dysmorphology / Genitalia size HOM 7f:4m Fisher Exact Test framework 1.00 Not tested (No variation) - OK
Slc25a29tm1a(KOMP)Wtsi WTSI Dysmorphology / Genitalia size HOM 7f:4m Fisher Exact Test framework 1.00 Not tested (No variation) - OK
Slc25a29tm1a(KOMP)Wtsi WTSI Dysmorphology / Genitalia size HOM 0f:3m - 1.00 FAILED - Not enough mutant or control data
Slc25a29tm1a(KOMP)Wtsi WTSI Dysmorphology / Genitalia size HOM 0f:3m - 1.00 FAILED - Not enough mutant or control data
Slc25a29tm1a(KOMP)Wtsi WTSI X-ray / Joints HOM 0f:3m - 1.00 FAILED - Not enough mutant or control data
Slc25a29tm1a(KOMP)Wtsi WTSI X-ray / Joints HOM 0f:3m - 1.00 FAILED - Not enough mutant or control data
Slc25a29tm1a(KOMP)Wtsi WTSI X-ray / Joints HOM 6f:4m Fisher Exact Test framework 1.00 Success
Slc25a29tm1a(KOMP)Wtsi WTSI X-ray / Joints HOM 6f:4m Fisher Exact Test framework 1.00 Success
Slc25a29tm1a(KOMP)Wtsi WTSI Antigen Specific Immunoglobulin Assay / TetC specific IgG1 HOM 0f:4m Mixed Model framework, generalized least squares, equation withoutWeight 0.796 Success
Slc25a29tm1a(KOMP)Wtsi WTSI X-ray / Clavicle HOM 0f:3m - 1.00 FAILED - Not enough mutant or control data
Slc25a29tm1a(KOMP)Wtsi WTSI X-ray / Clavicle HOM 0f:3m - 1.00 FAILED - Not enough mutant or control data
Slc25a29tm1a(KOMP)Wtsi WTSI X-ray / Clavicle HOM 7f:4m Fisher Exact Test framework 1.00 Not tested (No variation) - OK
Slc25a29tm1a(KOMP)Wtsi WTSI X-ray / Clavicle HOM 7f:4m Fisher Exact Test framework 1.00 Not tested (No variation) - OK
Slc25a29tm1a(KOMP)Wtsi WTSI X-ray / Digit integrity HOM 0f:3m - 1.00 FAILED - Not enough mutant or control data
Slc25a29tm1a(KOMP)Wtsi WTSI X-ray / Digit integrity HOM 0f:3m - 1.00 FAILED - Not enough mutant or control data
Slc25a29tm1a(KOMP)Wtsi WTSI X-ray / Digit integrity HOM 7f:4m Fisher Exact Test framework 1.00 Success
Slc25a29tm1a(KOMP)Wtsi WTSI X-ray / Digit integrity HOM 7f:4m Fisher Exact Test framework 1.00 Success
Slc25a29tm1a(KOMP)Wtsi WTSI X-ray / Completeness of digits HOM 0f:3m - 1.00 FAILED - Not enough mutant or control data
Slc25a29tm1a(KOMP)Wtsi WTSI X-ray / Completeness of digits HOM 0f:3m - 1.00 FAILED - Not enough mutant or control data
Slc25a29tm1a(KOMP)Wtsi WTSI X-ray / Completeness of digits HOM 7f:4m Fisher Exact Test framework 1.00 Not tested (No variation) - OK
Slc25a29tm1a(KOMP)Wtsi WTSI X-ray / Completeness of digits HOM 7f:4m Fisher Exact Test framework 1.00 Not tested (No variation) - OK
Slc25a29tm1a(KOMP)Wtsi WTSI Dysmorphology / Genitalia morphology HOM 0f:3m - 1.00 FAILED - Not enough mutant or control data
Slc25a29tm1a(KOMP)Wtsi WTSI Dysmorphology / Genitalia morphology HOM 0f:3m - 1.00 FAILED - Not enough mutant or control data
Slc25a29tm1a(KOMP)Wtsi WTSI Dysmorphology / Genitalia morphology HOM 7f:4m Fisher Exact Test framework 1.00 Not tested (No variation) - OK
Slc25a29tm1a(KOMP)Wtsi WTSI Dysmorphology / Genitalia morphology HOM 7f:4m Fisher Exact Test framework 1.00 Not tested (No variation) - OK
Slc25a29tm1a(KOMP)Wtsi WTSI Dysmorphology / Genitalia HOM 0f:3m - 1.00 FAILED - Not enough mutant or control data
Slc25a29tm1a(KOMP)Wtsi WTSI Dysmorphology / Genitalia HOM 7f:4m Fisher Exact Test framework 1.00 Not tested (No variation) - OK
Slc25a29tm1a(KOMP)Wtsi WTSI Dysmorphology / Genitalia HOM 0f:3m - 1.00 FAILED - Not enough mutant or control data
Slc25a29tm1a(KOMP)Wtsi WTSI Dysmorphology / Genitalia HOM 7f:4m Fisher Exact Test framework 1.00 Not tested (No variation) - OK
Slc25a29tm1a(KOMP)Wtsi WTSI Dysmorphology / Forepaw nails HOM 7f:4m Fisher Exact Test framework 1.00 Success
Slc25a29tm1a(KOMP)Wtsi WTSI Dysmorphology / Forepaw nails HOM 0f:3m - 1.00 FAILED - Not enough mutant or control data
Slc25a29tm1a(KOMP)Wtsi WTSI Dysmorphology / Forepaw nails HOM 0f:3m - 1.00 FAILED - Not enough mutant or control data
Slc25a29tm1a(KOMP)Wtsi WTSI Dysmorphology / Forepaw nails HOM 7f:4m Fisher Exact Test framework 1.00 Success
Slc25a29tm1a(KOMP)Wtsi WTSI Dysmorphology / Forepaw Foot pads HOM 7f:4m Fisher Exact Test framework 1.00 Success
Slc25a29tm1a(KOMP)Wtsi WTSI Dysmorphology / Forepaw Foot pads HOM 0f:3m - 1.00 FAILED - Not enough mutant or control data
Slc25a29tm1a(KOMP)Wtsi WTSI Dysmorphology / Forepaw Foot pads HOM 0f:3m - 1.00 FAILED - Not enough mutant or control data
Slc25a29tm1a(KOMP)Wtsi WTSI Dysmorphology / Forepaw Foot pads HOM 7f:4m Fisher Exact Test framework 1.00 Success
Slc25a29tm1a(KOMP)Wtsi WTSI Dysmorphology / Forepaw size HOM 7f:4m Fisher Exact Test framework 1.00 Not tested (No variation) - OK
Slc25a29tm1a(KOMP)Wtsi WTSI Dysmorphology / Forepaw size HOM 0f:3m - 1.00 FAILED - Not enough mutant or control data
Slc25a29tm1a(KOMP)Wtsi WTSI Dysmorphology / Forepaw size HOM 0f:3m - 1.00 FAILED - Not enough mutant or control data
Slc25a29tm1a(KOMP)Wtsi WTSI Dysmorphology / Forepaw size HOM 7f:4m Fisher Exact Test framework 1.00 Not tested (No variation) - OK
Slc25a29tm1a(KOMP)Wtsi WTSI Dysmorphology / Forelimb size HOM 7f:4m Fisher Exact Test framework 1.00 Not tested (No variation) - OK
Slc25a29tm1a(KOMP)Wtsi WTSI Dysmorphology / Forelimb size HOM 0f:3m - 1.00 FAILED - Not enough mutant or control data
Slc25a29tm1a(KOMP)Wtsi WTSI Dysmorphology / Forelimb size HOM 0f:3m - 1.00 FAILED - Not enough mutant or control data
Slc25a29tm1a(KOMP)Wtsi WTSI Dysmorphology / Forelimb size HOM 7f:4m Fisher Exact Test framework 1.00 Not tested (No variation) - OK
Slc25a29tm1a(KOMP)Wtsi WTSI Dysmorphology / Hindlimb nails HOM 7f:4m Fisher Exact Test framework 0.608 Success
Slc25a29tm1a(KOMP)Wtsi WTSI Dysmorphology / Hindlimb nails HOM 7f:4m Fisher Exact Test framework 0.608 Success
Slc25a29tm1a(KOMP)Wtsi WTSI Dysmorphology / Hindlimb nails HOM 0f:3m - 1.00 FAILED - Not enough mutant or control data
Slc25a29tm1a(KOMP)Wtsi WTSI Dysmorphology / Hindlimb nails HOM 0f:3m - 1.00 FAILED - Not enough mutant or control data
Slc25a29tm1a(KOMP)Wtsi WTSI Dysmorphology / Hindlimb foot pads HOM 0f:3m - 1.00 FAILED - Not enough mutant or control data
Slc25a29tm1a(KOMP)Wtsi WTSI Dysmorphology / Hindlimb foot pads HOM 7f:4m Fisher Exact Test framework 1.00 Success
Slc25a29tm1a(KOMP)Wtsi WTSI Dysmorphology / Hindlimb foot pads HOM 7f:4m Fisher Exact Test framework 1.00 Success
Slc25a29tm1a(KOMP)Wtsi WTSI Dysmorphology / Hindlimb foot pads HOM 0f:3m - 1.00 FAILED - Not enough mutant or control data
Slc25a29tm1a(KOMP)Wtsi WTSI Dysmorphology / Hind paw size HOM 0f:3m - 1.00 FAILED - Not enough mutant or control data
Slc25a29tm1a(KOMP)Wtsi WTSI Dysmorphology / Hind paw size HOM 0f:3m - 1.00 FAILED - Not enough mutant or control data
Slc25a29tm1a(KOMP)Wtsi WTSI Dysmorphology / Hind paw size HOM 7f:4m Fisher Exact Test framework 1.00 Not tested (No variation) - OK
Slc25a29tm1a(KOMP)Wtsi WTSI Dysmorphology / Hind paw size HOM 7f:4m Fisher Exact Test framework 1.00 Not tested (No variation) - OK
Slc25a29tm1a(KOMP)Wtsi WTSI Dysmorphology / Hindlimb size HOM 0f:3m - 1.00 FAILED - Not enough mutant or control data
Slc25a29tm1a(KOMP)Wtsi WTSI Dysmorphology / Hindlimb size HOM 0f:3m - 1.00 FAILED - Not enough mutant or control data
Slc25a29tm1a(KOMP)Wtsi WTSI Dysmorphology / Hindlimb size HOM 7f:4m Fisher Exact Test framework 1.00 Not tested (No variation) - OK
Slc25a29tm1a(KOMP)Wtsi WTSI Dysmorphology / Hindlimb size HOM 7f:4m Fisher Exact Test framework 1.00 Not tested (No variation) - OK
Slc25a29tm1a(KOMP)Wtsi WTSI X-ray / Number of ribs right HOM 0f:3m Not processed 1.00 FAILED - Not enough mutant or control data
Slc25a29tm1a(KOMP)Wtsi WTSI X-ray / Number of ribs right HOM 0f:3m Not processed 1.00 FAILED - Not enough mutant or control data
Slc25a29tm1a(KOMP)Wtsi WTSI X-ray / Number of ribs right HOM 7f:4m Not processed 1.00 FAILED - No variability in dependent variable 'M.G.P_006_001_016'.
Slc25a29tm1a(KOMP)Wtsi WTSI X-ray / Number of ribs right HOM 7f:4m Not processed 1.00 FAILED - No variability in dependent variable 'M.G.P_006_001_016'.
Slc25a29tm1a(KOMP)Wtsi WTSI X-ray / Number of ribs left HOM 0f:3m Not processed 1.00 FAILED - Not enough mutant or control data
Slc25a29tm1a(KOMP)Wtsi WTSI X-ray / Number of ribs left HOM 0f:3m Not processed 1.00 FAILED - Not enough mutant or control data
Slc25a29tm1a(KOMP)Wtsi WTSI X-ray / Number of ribs left HOM 7f:4m Not processed 1.00 FAILED - No variability in dependent variable 'M.G.P_006_001_015'.
Slc25a29tm1a(KOMP)Wtsi WTSI X-ray / Number of ribs left HOM 7f:4m Not processed 1.00 FAILED - No variability in dependent variable 'M.G.P_006_001_015'.
Slc25a29tm1a(KOMP)Wtsi WTSI X-ray / Scapulae HOM 0f:3m - 1.00 FAILED - Not enough mutant or control data
Slc25a29tm1a(KOMP)Wtsi WTSI X-ray / Scapulae HOM 0f:3m - 1.00 FAILED - Not enough mutant or control data
Slc25a29tm1a(KOMP)Wtsi WTSI X-ray / Scapulae HOM 7f:4m Fisher Exact Test framework 1.00 Not tested (No variation) - OK
Slc25a29tm1a(KOMP)Wtsi WTSI X-ray / Scapulae HOM 7f:4m Fisher Exact Test framework 1.00 Not tested (No variation) - OK
Slc25a29tm1a(KOMP)Wtsi WTSI X-ray / Shape of ribs HOM 0f:3m - 1.00 FAILED - Not enough mutant or control data
Slc25a29tm1a(KOMP)Wtsi WTSI X-ray / Shape of ribs HOM 0f:3m - 1.00 FAILED - Not enough mutant or control data
Slc25a29tm1a(KOMP)Wtsi WTSI X-ray / Shape of ribs HOM 7f:4m Fisher Exact Test framework 1.00 Not tested (No variation) - OK
Slc25a29tm1a(KOMP)Wtsi WTSI X-ray / Shape of ribs HOM 7f:4m Fisher Exact Test framework 1.00 Not tested (No variation) - OK
Slc25a29tm1a(KOMP)Wtsi WTSI X-ray / Skull shape HOM 0f:3m - 1.00 FAILED - Not enough mutant or control data
Slc25a29tm1a(KOMP)Wtsi WTSI X-ray / Skull shape HOM 0f:3m - 1.00 FAILED - Not enough mutant or control data
Slc25a29tm1a(KOMP)Wtsi WTSI X-ray / Skull shape HOM 6f:4m Fisher Exact Test framework 1.00 Success
Slc25a29tm1a(KOMP)Wtsi WTSI X-ray / Skull shape HOM 6f:4m Fisher Exact Test framework 1.00 Success
Slc25a29tm1a(KOMP)Wtsi WTSI X-ray / Maxilla HOM 0f:3m - 1.00 FAILED - Not enough mutant or control data
Slc25a29tm1a(KOMP)Wtsi WTSI X-ray / Maxilla HOM 0f:3m - 1.00 FAILED - Not enough mutant or control data
Slc25a29tm1a(KOMP)Wtsi WTSI X-ray / Maxilla HOM 6f:4m Fisher Exact Test framework 1.00 Success
Slc25a29tm1a(KOMP)Wtsi WTSI X-ray / Maxilla HOM 6f:4m Fisher Exact Test framework 1.00 Success
Slc25a29tm1a(KOMP)Wtsi WTSI X-ray / Pelvis HOM 0f:3m - 1.00 FAILED - Not enough mutant or control data
Slc25a29tm1a(KOMP)Wtsi WTSI X-ray / Pelvis HOM 0f:3m - 1.00 FAILED - Not enough mutant or control data
Slc25a29tm1a(KOMP)Wtsi WTSI X-ray / Pelvis HOM 7f:4m Fisher Exact Test framework 1.00 Success
Slc25a29tm1a(KOMP)Wtsi WTSI X-ray / Pelvis HOM 7f:4m Fisher Exact Test framework 1.00 Success
Slc25a29tm1a(KOMP)Wtsi WTSI X-ray / Orbit HOM 0f:3m - 1.00 FAILED - Not enough mutant or control data
Slc25a29tm1a(KOMP)Wtsi WTSI X-ray / Orbit HOM 0f:3m - 1.00 FAILED - Not enough mutant or control data
Slc25a29tm1a(KOMP)Wtsi WTSI X-ray / Orbit HOM 7f:4m Fisher Exact Test framework 1.00 Success
Slc25a29tm1a(KOMP)Wtsi WTSI X-ray / Orbit HOM 7f:4m Fisher Exact Test framework 1.00 Success
Slc25a29tm1a(KOMP)Wtsi WTSI Buffy coat peripheral blood leukocyte immunophenotyping / B cell CD19+ percentage HOM 7f:4m Mixed Model framework, linear mixed-effects model, equation withoutWeight 0.119 Success
Slc25a29tm1a(KOMP)Wtsi WTSI X-ray / Rib HOM 0f:3m - 1.00 FAILED - Not enough mutant or control data
Slc25a29tm1a(KOMP)Wtsi WTSI X-ray / Rib HOM 0f:3m - 1.00 FAILED - Not enough mutant or control data
Slc25a29tm1a(KOMP)Wtsi WTSI X-ray / Rib HOM 7f:4m Fisher Exact Test framework 1.00 Not tested (No variation) - OK
Slc25a29tm1a(KOMP)Wtsi WTSI X-ray / Rib HOM 7f:4m Fisher Exact Test framework 1.00 Not tested (No variation) - OK
Slc25a29tm1a(KOMP)Wtsi WTSI X-ray / Radius HOM 0f:3m - 1.00 FAILED - Not enough mutant or control data
Slc25a29tm1a(KOMP)Wtsi WTSI X-ray / Radius HOM 0f:3m - 1.00 FAILED - Not enough mutant or control data
Slc25a29tm1a(KOMP)Wtsi WTSI X-ray / Radius HOM 7f:4m Fisher Exact Test framework 1.00 Success
Slc25a29tm1a(KOMP)Wtsi WTSI X-ray / Radius HOM 7f:4m Fisher Exact Test framework 1.00 Success
Slc25a29tm1a(KOMP)Wtsi WTSI Buffy coat peripheral blood leukocyte immunophenotyping / Mature B cell IgD+ percentage HOM 7f:4m Mixed Model framework, linear mixed-effects model, equation withoutWeight 0.133 Success
Slc25a29tm1a(KOMP)Wtsi WTSI Dysmorphology / Tail morphology HOM 7f:4m Fisher Exact Test framework 1.00 Not tested (No variation) - OK
Slc25a29tm1a(KOMP)Wtsi WTSI Dysmorphology / Tail morphology HOM 0f:3m - 1.00 FAILED - Not enough mutant or control data
Slc25a29tm1a(KOMP)Wtsi WTSI Dysmorphology / Tail morphology HOM 0f:3m - 1.00 FAILED - Not enough mutant or control data
Slc25a29tm1a(KOMP)Wtsi WTSI Dysmorphology / Tail morphology HOM 7f:4m Fisher Exact Test framework 1.00 Not tested (No variation) - OK
Slc25a29tm1a(KOMP)Wtsi WTSI Dysmorphology / Tail length HOM 0f:3m - 1.00 FAILED - Not enough mutant or control data
Slc25a29tm1a(KOMP)Wtsi WTSI Dysmorphology / Tail length HOM 0f:3m - 1.00 FAILED - Not enough mutant or control data
Slc25a29tm1a(KOMP)Wtsi WTSI Dysmorphology / Tail length HOM 7f:4m Fisher Exact Test framework 1.00 Not tested (No variation) - OK
Slc25a29tm1a(KOMP)Wtsi WTSI Dysmorphology / Tail length HOM 7f:4m Fisher Exact Test framework 1.00 Not tested (No variation) - OK
Slc25a29tm1a(KOMP)Wtsi WTSI X-ray / Number of lumbar vertebrae HOM 0f:3m Not processed 1.00 FAILED - Not enough mutant or control data
Slc25a29tm1a(KOMP)Wtsi WTSI X-ray / Number of lumbar vertebrae HOM 0f:3m Not processed 1.00 FAILED - Not enough mutant or control data
Slc25a29tm1a(KOMP)Wtsi WTSI X-ray / Number of lumbar vertebrae HOM 7f:4m Not processed 1.00 FAILED - testDataset returned an error, check log file
Slc25a29tm1a(KOMP)Wtsi WTSI X-ray / Number of lumbar vertebrae HOM 7f:4m Not processed 1.00 FAILED - testDataset returned an error, check log file
Slc25a29tm1a(KOMP)Wtsi WTSI X-ray / Fusion of vertebrae HOM 7f:4m Fisher Exact Test framework 0.0800 Success
Slc25a29tm1a(KOMP)Wtsi WTSI X-ray / Fusion of vertebrae HOM 7f:4m Fisher Exact Test framework 0.0800 Success
Slc25a29tm1a(KOMP)Wtsi WTSI X-ray / Fusion of vertebrae HOM 0f:3m - 1.00 FAILED - Not enough mutant or control data
Slc25a29tm1a(KOMP)Wtsi WTSI X-ray / Fusion of vertebrae HOM 0f:3m - 1.00 FAILED - Not enough mutant or control data
Slc25a29tm1a(KOMP)Wtsi WTSI X-ray / Processes on vertebrae HOM 6f:4m Fisher Exact Test framework 0.540 Success
Slc25a29tm1a(KOMP)Wtsi WTSI X-ray / Processes on vertebrae HOM 6f:4m Fisher Exact Test framework 0.540 Success
Slc25a29tm1a(KOMP)Wtsi WTSI X-ray / Processes on vertebrae HOM 0f:3m - 1.00 FAILED - Not enough mutant or control data
Slc25a29tm1a(KOMP)Wtsi WTSI X-ray / Processes on vertebrae HOM 0f:3m - 1.00 FAILED - Not enough mutant or control data
Slc25a29tm1a(KOMP)Wtsi WTSI X-ray / Number of pelvic vertebrae HOM 0f:3m Not processed 1.00 FAILED - Not enough mutant or control data
Slc25a29tm1a(KOMP)Wtsi WTSI X-ray / Number of pelvic vertebrae HOM 0f:3m Not processed 1.00 FAILED - Not enough mutant or control data
Slc25a29tm1a(KOMP)Wtsi WTSI X-ray / Number of pelvic vertebrae HOM 7f:4m Not processed 1.00 FAILED - testDataset returned an error, check log file
Slc25a29tm1a(KOMP)Wtsi WTSI X-ray / Number of pelvic vertebrae HOM 7f:4m Not processed 1.00 FAILED - testDataset returned an error, check log file
Slc25a29tm1a(KOMP)Wtsi WTSI Buffy coat peripheral blood leukocyte immunophenotyping / T cell CD4+ percentage HOM 7f:4m Mixed Model framework, linear mixed-effects model, equation withoutWeight 0.437 Success
Slc25a29tm1a(KOMP)Wtsi WTSI X-ray / Teeth HOM 6f:4m Fisher Exact Test framework 0.0779 Success
Slc25a29tm1a(KOMP)Wtsi WTSI X-ray / Teeth HOM 6f:4m Fisher Exact Test framework 0.0779 Success
Slc25a29tm1a(KOMP)Wtsi WTSI X-ray / Teeth HOM 0f:3m - 1.00 FAILED - Not enough mutant or control data
Slc25a29tm1a(KOMP)Wtsi WTSI X-ray / Teeth HOM 0f:3m - 1.00 FAILED - Not enough mutant or control data
Slc25a29tm1a(KOMP)Wtsi WTSI X-ray / Syndactylism HOM 0f:3m - 1.00 FAILED - Not enough mutant or control data
Slc25a29tm1a(KOMP)Wtsi WTSI X-ray / Syndactylism HOM 0f:3m - 1.00 FAILED - Not enough mutant or control data
Slc25a29tm1a(KOMP)Wtsi WTSI X-ray / Syndactylism HOM 7f:4m Fisher Exact Test framework 1.00 Not tested (No variation) - OK
Slc25a29tm1a(KOMP)Wtsi WTSI X-ray / Syndactylism HOM 7f:4m Fisher Exact Test framework 1.00 Not tested (No variation) - OK
Slc25a29tm1a(KOMP)Wtsi WTSI X-ray / Ulna HOM 0f:3m - 1.00 FAILED - Not enough mutant or control data
Slc25a29tm1a(KOMP)Wtsi WTSI X-ray / Ulna HOM 0f:3m - 1.00 FAILED - Not enough mutant or control data
Slc25a29tm1a(KOMP)Wtsi WTSI X-ray / Ulna HOM 7f:4m Fisher Exact Test framework 1.00 Success
Slc25a29tm1a(KOMP)Wtsi WTSI X-ray / Ulna HOM 7f:4m Fisher Exact Test framework 1.00 Success
Slc25a29tm1a(KOMP)Wtsi WTSI X-ray / Tibia HOM 0f:3m - 1.00 FAILED - Not enough mutant or control data
Slc25a29tm1a(KOMP)Wtsi WTSI X-ray / Tibia HOM 0f:3m - 1.00 FAILED - Not enough mutant or control data
Slc25a29tm1a(KOMP)Wtsi WTSI X-ray / Tibia HOM 7f:4m Fisher Exact Test framework 1.00 Not tested (No variation) - OK
Slc25a29tm1a(KOMP)Wtsi WTSI X-ray / Tibia HOM 7f:4m Fisher Exact Test framework 1.00 Not tested (No variation) - OK
Slc25a29tm1a(KOMP)Wtsi WTSI X-ray / Number of cervical vertebrae HOM 0f:3m Not processed 1.00 FAILED - Not enough mutant or control data
Slc25a29tm1a(KOMP)Wtsi WTSI X-ray / Number of cervical vertebrae HOM 0f:3m Not processed 1.00 FAILED - Not enough mutant or control data
Slc25a29tm1a(KOMP)Wtsi WTSI X-ray / Number of cervical vertebrae HOM 7f:4m Not processed 1.00 FAILED - No variability in dependent variable 'M.G.P_006_001_025'.
Slc25a29tm1a(KOMP)Wtsi WTSI X-ray / Number of cervical vertebrae HOM 7f:4m Not processed 1.00 FAILED - No variability in dependent variable 'M.G.P_006_001_025'.
Slc25a29tm1a(KOMP)Wtsi WTSI X-ray / Number of caudal vertebrae HOM 0f:3m Not processed 1.00 FAILED - Not enough mutant or control data
Slc25a29tm1a(KOMP)Wtsi WTSI X-ray / Number of caudal vertebrae HOM 0f:3m Not processed 1.00 FAILED - Not enough mutant or control data
Slc25a29tm1a(KOMP)Wtsi WTSI X-ray / Number of caudal vertebrae HOM 7f:4m Not processed 1.00 FAILED - testDataset returned an error, check log file
Slc25a29tm1a(KOMP)Wtsi WTSI X-ray / Number of caudal vertebrae HOM 7f:4m Not processed 1.00 FAILED - testDataset returned an error, check log file
Slc25a29tm1a(KOMP)Wtsi WTSI Indirect Calorimetry / Total Food intake HOM 0f:3m Not processed 1.00 FAILED - Not enough mutant or control data
Slc25a29tm1a(KOMP)Wtsi WTSI Indirect Calorimetry / Total Food intake HOM 0f:3m Not processed 1.00 FAILED - Not enough mutant or control data
Slc25a29tm1a(KOMP)Wtsi WTSI Slit Lamp / cornea vascularisation HOM 7f:4m Fisher Exact Test framework 1.00 Success
Slc25a29tm1a(KOMP)Wtsi WTSI Slit Lamp / cornea vascularisation HOM 7f:4m Fisher Exact Test framework 1.00 Success
Slc25a29tm1a(KOMP)Wtsi WTSI Slit Lamp / cornea vascularisation HOM 0f:3m - 1.00 FAILED - Not enough mutant or control data
Slc25a29tm1a(KOMP)Wtsi WTSI Slit Lamp / cornea vascularisation HOM 0f:3m - 1.00 FAILED - Not enough mutant or control data
Slc25a29tm1a(KOMP)Wtsi WTSI Slit Lamp / cornea opacity HOM 7f:4m Fisher Exact Test framework 1.00 Success
Slc25a29tm1a(KOMP)Wtsi WTSI Slit Lamp / cornea opacity HOM 7f:4m Fisher Exact Test framework 1.00 Success
Slc25a29tm1a(KOMP)Wtsi WTSI Slit Lamp / cornea opacity HOM 0f:3m - 1.00 FAILED - Not enough mutant or control data
Slc25a29tm1a(KOMP)Wtsi WTSI Slit Lamp / cornea opacity HOM 0f:3m - 1.00 FAILED - Not enough mutant or control data
Slc25a29tm1a(KOMP)Wtsi WTSI Slit Lamp / lens HOM 0f:3m - 1.00 FAILED - Not enough mutant or control data
Slc25a29tm1a(KOMP)Wtsi WTSI Slit Lamp / lens HOM 7f:4m Fisher Exact Test framework 1.00 Success
Slc25a29tm1a(KOMP)Wtsi WTSI Slit Lamp / lens HOM 7f:4m Fisher Exact Test framework 1.00 Success
Slc25a29tm1a(KOMP)Wtsi WTSI Slit Lamp / lens HOM 0f:3m - 1.00 FAILED - Not enough mutant or control data
Slc25a29tm1a(KOMP)Wtsi WTSI X-ray / Shape of vertebrae HOM 0f:3m - 1.00 FAILED - Not enough mutant or control data
Slc25a29tm1a(KOMP)Wtsi WTSI X-ray / Shape of vertebrae HOM 0f:3m - 1.00 FAILED - Not enough mutant or control data
Slc25a29tm1a(KOMP)Wtsi WTSI X-ray / Shape of vertebrae HOM 7f:4m Fisher Exact Test framework 1.00 Success
Slc25a29tm1a(KOMP)Wtsi WTSI X-ray / Shape of vertebrae HOM 7f:4m Fisher Exact Test framework 1.00 Success
Slc25a29tm1a(KOMP)Wtsi WTSI Slit Lamp / Eye HOM 7f:4m Fisher Exact Test framework 0.130 Success
Slc25a29tm1a(KOMP)Wtsi WTSI Slit Lamp / Eye HOM 7f:4m Fisher Exact Test framework 0.130 Success
Slc25a29tm1a(KOMP)Wtsi WTSI Slit Lamp / Eye HOM 0f:3m - 1.00 FAILED - Not enough mutant or control data
Slc25a29tm1a(KOMP)Wtsi WTSI Slit Lamp / Eye HOM 0f:3m - 1.00 FAILED - Not enough mutant or control data
Slc25a29tm1a(KOMP)Wtsi WTSI X-ray / Number of thoracic vertebrae HOM 0f:3m Not processed 1.00 FAILED - Not enough mutant or control data
Slc25a29tm1a(KOMP)Wtsi WTSI X-ray / Number of thoracic vertebrae HOM 0f:3m Not processed 1.00 FAILED - Not enough mutant or control data
Slc25a29tm1a(KOMP)Wtsi WTSI X-ray / Number of thoracic vertebrae HOM 7f:4m Not processed 1.00 FAILED - No variability in dependent variable 'M.G.P_006_001_031'.
Slc25a29tm1a(KOMP)Wtsi WTSI X-ray / Number of thoracic vertebrae HOM 7f:4m Not processed 1.00 FAILED - No variability in dependent variable 'M.G.P_006_001_031'.
Slc25a29tm1a(KOMP)Wtsi WTSI Slit Lamp / Eye (+) blood presence HOM 7f:4m Fisher Exact Test framework 1.00 Not tested (No variation) - OK
Slc25a29tm1a(KOMP)Wtsi WTSI Slit Lamp / Eye (+) blood presence HOM 7f:4m Fisher Exact Test framework 1.00 Not tested (No variation) - OK
Slc25a29tm1a(KOMP)Wtsi WTSI Slit Lamp / Eye (+) blood presence HOM 0f:3m - 1.00 FAILED - Not enough mutant or control data
Slc25a29tm1a(KOMP)Wtsi WTSI Slit Lamp / Eye (+) blood presence HOM 0f:3m - 1.00 FAILED - Not enough mutant or control data
Slc25a29tm1a(KOMP)Wtsi WTSI Slit Lamp / Eye size HOM 7f:4m Fisher Exact Test framework 1.00 Not tested (No variation) - OK
Slc25a29tm1a(KOMP)Wtsi WTSI Slit Lamp / Eye size HOM 7f:4m Fisher Exact Test framework 1.00 Not tested (No variation) - OK
Slc25a29tm1a(KOMP)Wtsi WTSI Slit Lamp / Eye size HOM 0f:3m - 1.00 FAILED - Not enough mutant or control data
Slc25a29tm1a(KOMP)Wtsi WTSI Slit Lamp / Eye size HOM 0f:3m - 1.00 FAILED - Not enough mutant or control data
Slc25a29tm1a(KOMP)Wtsi WTSI Slit Lamp / cornea HOM 7f:4m Fisher Exact Test framework 1.00 Success
Slc25a29tm1a(KOMP)Wtsi WTSI Slit Lamp / cornea HOM 7f:4m Fisher Exact Test framework 1.00 Success
Slc25a29tm1a(KOMP)Wtsi WTSI Slit Lamp / cornea HOM 0f:3m - 1.00 FAILED - Not enough mutant or control data
Slc25a29tm1a(KOMP)Wtsi WTSI Slit Lamp / cornea HOM 0f:3m - 1.00 FAILED - Not enough mutant or control data
Slc25a29tm1a(KOMP)Wtsi WTSI X-ray / Tibia Length HOM 0f:3m Not processed 1.00 FAILED - Not enough mutant or control data
Slc25a29tm1a(KOMP)Wtsi WTSI X-ray / Tibia Length HOM 0f:3m Not processed 1.00 FAILED - Not enough mutant or control data
Slc25a29tm1a(KOMP)Wtsi WTSI Slit Lamp / Eyelid closure HOM 7f:4m Fisher Exact Test framework 1.00 Success
Slc25a29tm1a(KOMP)Wtsi WTSI Slit Lamp / Eyelid closure HOM 7f:4m Fisher Exact Test framework 1.00 Success
Slc25a29tm1a(KOMP)Wtsi WTSI Slit Lamp / Eyelid closure HOM 0f:3m - 1.00 FAILED - Not enough mutant or control data
Slc25a29tm1a(KOMP)Wtsi WTSI Slit Lamp / Eyelid closure HOM 0f:3m - 1.00 FAILED - Not enough mutant or control data
Slc25a29tm1a(KOMP)Wtsi WTSI Buffy coat peripheral blood leukocyte immunophenotyping / CD4+CD44+CD62L- percentage HOM 7f:4m Mixed Model framework, linear mixed-effects model, equation withoutWeight 0.383 Success
Slc25a29tm1a(KOMP)Wtsi WTSI Antigen Specific Immunoglobulin Assay / TetC specific IgG2 HOM 0f:4m Mixed Model framework, linear mixed-effects model, equation withoutWeight 0.333 Success
Slc25a29tm1a(KOMP)Wtsi WTSI Slit Lamp / Iris/Pupil HOM 7f:4m Fisher Exact Test framework 1.00 Success
Slc25a29tm1a(KOMP)Wtsi WTSI Slit Lamp / Iris/Pupil HOM 0f:3m - 1.00 FAILED - Not enough mutant or control data
Slc25a29tm1a(KOMP)Wtsi WTSI Slit Lamp / Iris/Pupil HOM 7f:4m Fisher Exact Test framework 1.00 Success
Slc25a29tm1a(KOMP)Wtsi WTSI Slit Lamp / Iris/Pupil HOM 0f:3m - 1.00 FAILED - Not enough mutant or control data
Slc25a29tm1a(KOMP)Wtsi WTSI Slit Lamp / lens opacity HOM 0f:3m - 1.00 FAILED - Not enough mutant or control data
Slc25a29tm1a(KOMP)Wtsi WTSI Slit Lamp / lens opacity HOM 7f:4m Fisher Exact Test framework 1.00 Success
Slc25a29tm1a(KOMP)Wtsi WTSI Slit Lamp / lens opacity HOM 7f:4m Fisher Exact Test framework 1.00 Success
Slc25a29tm1a(KOMP)Wtsi WTSI Slit Lamp / lens opacity HOM 0f:3m - 1.00 FAILED - Not enough mutant or control data
Slc25a29tm1a(KOMP)Wtsi WTSI Slit Lamp / Iris/Pupil shape HOM 7f:4m Fisher Exact Test framework 1.00 Success
Slc25a29tm1a(KOMP)Wtsi WTSI Slit Lamp / Iris/Pupil shape HOM 7f:4m Fisher Exact Test framework 1.00 Success
Slc25a29tm1a(KOMP)Wtsi WTSI Slit Lamp / Iris/Pupil shape HOM 0f:3m - 1.00 FAILED - Not enough mutant or control data
Slc25a29tm1a(KOMP)Wtsi WTSI Slit Lamp / Iris/Pupil shape HOM 0f:3m - 1.00 FAILED - Not enough mutant or control data
Slc25a29tm1a(KOMP)Wtsi WTSI Slit Lamp / Iris/Pupil position HOM 7f:4m Fisher Exact Test framework 1.00 Success
Slc25a29tm1a(KOMP)Wtsi WTSI Slit Lamp / Iris/Pupil position HOM 7f:4m Fisher Exact Test framework 1.00 Success
Slc25a29tm1a(KOMP)Wtsi WTSI Slit Lamp / Iris/Pupil position HOM 0f:3m - 1.00 FAILED - Not enough mutant or control data
Slc25a29tm1a(KOMP)Wtsi WTSI Slit Lamp / Iris/Pupil position HOM 0f:3m - 1.00 FAILED - Not enough mutant or control data
Slc25a29tm1a(KOMP)Wtsi WTSI Slit Lamp / Iris pigment HOM 7f:4m Fisher Exact Test framework 1.00 Not tested (No variation) - OK
Slc25a29tm1a(KOMP)Wtsi WTSI Slit Lamp / Iris pigment HOM 7f:4m Fisher Exact Test framework 1.00 Not tested (No variation) - OK
Slc25a29tm1a(KOMP)Wtsi WTSI Slit Lamp / Iris pigment HOM 0f:3m - 1.00 FAILED - Not enough mutant or control data
Slc25a29tm1a(KOMP)Wtsi WTSI Slit Lamp / Iris pigment HOM 0f:3m - 1.00 FAILED - Not enough mutant or control data
Slc25a29tm1a(KOMP)Wtsi WTSI Slit Lamp / Iris/Pupil light response HOM 7f:4m Fisher Exact Test framework 1.00 Success
Slc25a29tm1a(KOMP)Wtsi WTSI Slit Lamp / Iris/Pupil light response HOM 7f:4m Fisher Exact Test framework 1.00 Success
Slc25a29tm1a(KOMP)Wtsi WTSI Slit Lamp / Iris/Pupil light response HOM 0f:3m - 1.00 FAILED - Not enough mutant or control data
Slc25a29tm1a(KOMP)Wtsi WTSI Slit Lamp / Iris/Pupil light response HOM 0f:3m - 1.00 FAILED - Not enough mutant or control data
Slc25a29tm1a(KOMP)Wtsi WTSI Slit Lamp / Digitial Image/s HOM 0f:3m Not processed 1.00 FAILED - Not enough mutant or control data
Slc25a29tm1a(KOMP)Wtsi WTSI Slit Lamp / Digitial Image/s HOM 0f:3m Not processed 1.00 FAILED - Not enough mutant or control data
Slc25a29tm1a(KOMP)Wtsi WTSI Modified SHIRPA / Body Position HOM 7f:4m Fisher Exact Test framework 1.00 Success
Slc25a29tm1a(KOMP)Wtsi WTSI Modified SHIRPA / Body Position HOM 0f:3m - 1.00 FAILED - Not enough mutant or control data
Slc25a29tm1a(KOMP)Wtsi WTSI Modified SHIRPA / Body Position HOM 0f:3m - 1.00 FAILED - Not enough mutant or control data
Slc25a29tm1a(KOMP)Wtsi WTSI Modified SHIRPA / Body Position HOM 7f:4m Fisher Exact Test framework 1.00 Success
Slc25a29tm1a(KOMP)Wtsi WTSI Modified SHIRPA / Defecation HOM 7f:4m Fisher Exact Test framework 0.362 Success
Slc25a29tm1a(KOMP)Wtsi WTSI Modified SHIRPA / Defecation HOM 7f:4m Fisher Exact Test framework 0.362 Success
Slc25a29tm1a(KOMP)Wtsi WTSI Modified SHIRPA / Defecation HOM 0f:3m - 1.00 FAILED - Not enough mutant or control data
Slc25a29tm1a(KOMP)Wtsi WTSI Modified SHIRPA / Defecation HOM 0f:3m - 1.00 FAILED - Not enough mutant or control data
Slc25a29tm1a(KOMP)Wtsi WTSI Modified SHIRPA / Tremor HOM 7f:4m Fisher Exact Test framework 0.201 Success
Slc25a29tm1a(KOMP)Wtsi WTSI Modified SHIRPA / Tremor HOM 7f:4m Fisher Exact Test framework 0.201 Success
Slc25a29tm1a(KOMP)Wtsi WTSI Modified SHIRPA / Tremor HOM 0f:3m - 1.00 FAILED - Not enough mutant or control data
Slc25a29tm1a(KOMP)Wtsi WTSI Modified SHIRPA / Tremor HOM 0f:3m - 1.00 FAILED - Not enough mutant or control data
Slc25a29tm1a(KOMP)Wtsi WTSI Modified SHIRPA / Palpebral Closure HOM 7f:4m Fisher Exact Test framework 1.00 Success
Slc25a29tm1a(KOMP)Wtsi WTSI Modified SHIRPA / Palpebral Closure HOM 0f:3m - 1.00 FAILED - Not enough mutant or control data
Slc25a29tm1a(KOMP)Wtsi WTSI Modified SHIRPA / Palpebral Closure HOM 0f:3m - 1.00 FAILED - Not enough mutant or control data
Slc25a29tm1a(KOMP)Wtsi WTSI Modified SHIRPA / Palpebral Closure HOM 7f:4m Fisher Exact Test framework 1.00 Success
Slc25a29tm1a(KOMP)Wtsi WTSI Modified SHIRPA / Urination HOM 7f:4m Fisher Exact Test framework 0.239 Success
Slc25a29tm1a(KOMP)Wtsi WTSI Modified SHIRPA / Urination HOM 7f:4m Fisher Exact Test framework 0.239 Success
Slc25a29tm1a(KOMP)Wtsi WTSI Modified SHIRPA / Urination HOM 0f:3m - 1.00 FAILED - Not enough mutant or control data
Slc25a29tm1a(KOMP)Wtsi WTSI Modified SHIRPA / Urination HOM 0f:3m - 1.00 FAILED - Not enough mutant or control data
Slc25a29tm1a(KOMP)Wtsi WTSI Modified SHIRPA / Transfer Arousal HOM 7f:4m Fisher Exact Test framework 0.101 Success
Slc25a29tm1a(KOMP)Wtsi WTSI Modified SHIRPA / Transfer Arousal HOM 7f:4m Fisher Exact Test framework 0.101 Success
Slc25a29tm1a(KOMP)Wtsi WTSI Modified SHIRPA / Transfer Arousal HOM 0f:3m - 1.00 FAILED - Not enough mutant or control data
Slc25a29tm1a(KOMP)Wtsi WTSI Modified SHIRPA / Transfer Arousal HOM 0f:3m - 1.00 FAILED - Not enough mutant or control data
Slc25a29tm1a(KOMP)Wtsi WTSI Modified SHIRPA / Lacrimation HOM 7f:4m Fisher Exact Test framework 1.00 Not tested (No variation) - OK
Slc25a29tm1a(KOMP)Wtsi WTSI Modified SHIRPA / Lacrimation HOM 0f:3m - 1.00 FAILED - Not enough mutant or control data
Slc25a29tm1a(KOMP)Wtsi WTSI Modified SHIRPA / Lacrimation HOM 0f:3m - 1.00 FAILED - Not enough mutant or control data
Slc25a29tm1a(KOMP)Wtsi WTSI Modified SHIRPA / Lacrimation HOM 7f:4m Fisher Exact Test framework 1.00 Not tested (No variation) - OK
Slc25a29tm1a(KOMP)Wtsi WTSI Modified SHIRPA / Gait HOM 0f:3m - 1.00 FAILED - Not enough mutant or control data
Slc25a29tm1a(KOMP)Wtsi WTSI Modified SHIRPA / Gait HOM 0f:3m - 1.00 FAILED - Not enough mutant or control data
Slc25a29tm1a(KOMP)Wtsi WTSI Modified SHIRPA / Gait HOM 7f:4m Fisher Exact Test framework 1.00 Success
Slc25a29tm1a(KOMP)Wtsi WTSI Modified SHIRPA / Gait HOM 7f:4m Fisher Exact Test framework 1.00 Success
Slc25a29tm1a(KOMP)Wtsi WTSI Modified SHIRPA / Locomotor activity HOM 7f:4m Mixed Model framework, generalized least squares, equation withoutWeight 0.475 Success
Slc25a29tm1a(KOMP)Wtsi WTSI Modified SHIRPA / Locomotor activity HOM 7f:4m Mixed Model framework, generalized least squares, equation withoutWeight 0.475 Success
Slc25a29tm1a(KOMP)Wtsi WTSI Modified SHIRPA / Locomotor activity HOM 0f:3m Not processed 1.00 FAILED - Not enough mutant or control data
Slc25a29tm1a(KOMP)Wtsi WTSI Modified SHIRPA / Locomotor activity HOM 0f:3m Not processed 1.00 FAILED - Not enough mutant or control data
Slc25a29tm1a(KOMP)Wtsi WTSI Fertility of Homozygous Knock-out Mice / Gross Findings Female HOM f:m Supplied as data Success
Slc25a29tm1a(KOMP)Wtsi WTSI Modified SHIRPA / Tail elevation HOM 7f:4m Fisher Exact Test framework 0.219 Success
Slc25a29tm1a(KOMP)Wtsi WTSI Modified SHIRPA / Tail elevation HOM 7f:4m Fisher Exact Test framework 0.219 Success
Slc25a29tm1a(KOMP)Wtsi WTSI Modified SHIRPA / Tail elevation HOM 0f:3m - 1.00 FAILED - Not enough mutant or control data
Slc25a29tm1a(KOMP)Wtsi WTSI Modified SHIRPA / Tail elevation HOM 0f:3m - 1.00 FAILED - Not enough mutant or control data
Slc25a29tm1a(KOMP)Wtsi WTSI Modified SHIRPA / Pelvic elevation HOM 0f:3m - 1.00 FAILED - Not enough mutant or control data
Slc25a29tm1a(KOMP)Wtsi WTSI Modified SHIRPA / Pelvic elevation HOM 0f:3m - 1.00 FAILED - Not enough mutant or control data
Slc25a29tm1a(KOMP)Wtsi WTSI Modified SHIRPA / Pelvic elevation HOM 7f:4m Fisher Exact Test framework 1.00 Success
Slc25a29tm1a(KOMP)Wtsi WTSI Modified SHIRPA / Pelvic elevation HOM 7f:4m Fisher Exact Test framework 1.00 Success
Slc25a29tm1a(KOMP)Wtsi WTSI Modified SHIRPA / Touch Escape HOM 7f:4m Fisher Exact Test framework 0.723 Success
Slc25a29tm1a(KOMP)Wtsi WTSI Modified SHIRPA / Touch Escape HOM 7f:4m Fisher Exact Test framework 0.723 Success
Slc25a29tm1a(KOMP)Wtsi WTSI Modified SHIRPA / Touch Escape HOM 0f:3m - 1.00 FAILED - Not enough mutant or control data
Slc25a29tm1a(KOMP)Wtsi WTSI Modified SHIRPA / Touch Escape HOM 0f:3m - 1.00 FAILED - Not enough mutant or control data
Slc25a29tm1a(KOMP)Wtsi WTSI Modified SHIRPA / Startle Response HOM 0f:3m - 1.00 FAILED - Not enough mutant or control data
Slc25a29tm1a(KOMP)Wtsi WTSI Modified SHIRPA / Startle Response HOM 0f:3m - 1.00 FAILED - Not enough mutant or control data
Slc25a29tm1a(KOMP)Wtsi WTSI Modified SHIRPA / Startle Response HOM 7f:4m Fisher Exact Test framework 1.00 Success
Slc25a29tm1a(KOMP)Wtsi WTSI Modified SHIRPA / Startle Response HOM 7f:4m Fisher Exact Test framework 1.00 Success
Slc25a29tm1a(KOMP)Wtsi WTSI Modified SHIRPA / Trunk Curl HOM 7f:4m Fisher Exact Test framework 1.00 Not tested (No variation) - OK
Slc25a29tm1a(KOMP)Wtsi WTSI Modified SHIRPA / Trunk Curl HOM 0f:3m - 1.00 FAILED - Not enough mutant or control data
Slc25a29tm1a(KOMP)Wtsi WTSI Modified SHIRPA / Trunk Curl HOM 0f:3m - 1.00 FAILED - Not enough mutant or control data
Slc25a29tm1a(KOMP)Wtsi WTSI Modified SHIRPA / Trunk Curl HOM 7f:4m Fisher Exact Test framework 1.00 Not tested (No variation) - OK
Slc25a29tm1a(KOMP)Wtsi WTSI Modified SHIRPA / Positional Passivity HOM 0f:3m - 1.00 FAILED - Not enough mutant or control data
Slc25a29tm1a(KOMP)Wtsi WTSI Modified SHIRPA / Positional Passivity HOM 0f:3m - 1.00 FAILED - Not enough mutant or control data
Slc25a29tm1a(KOMP)Wtsi WTSI Modified SHIRPA / Positional Passivity HOM 7f:4m Fisher Exact Test framework 1.00 Success
Slc25a29tm1a(KOMP)Wtsi WTSI Modified SHIRPA / Positional Passivity HOM 7f:4m Fisher Exact Test framework 1.00 Success
Slc25a29tm1a(KOMP)Wtsi WTSI Modified SHIRPA / Pinna Reflex HOM 0f:3m - 1.00 FAILED - Not enough mutant or control data
Slc25a29tm1a(KOMP)Wtsi WTSI Modified SHIRPA / Pinna Reflex HOM 0f:3m - 1.00 FAILED - Not enough mutant or control data
Slc25a29tm1a(KOMP)Wtsi WTSI Modified SHIRPA / Pinna Reflex HOM 7f:4m Fisher Exact Test framework 1.00 Not tested (No variation) - OK
Slc25a29tm1a(KOMP)Wtsi WTSI Modified SHIRPA / Pinna Reflex HOM 7f:4m Fisher Exact Test framework 1.00 Not tested (No variation) - OK
Slc25a29tm1a(KOMP)Wtsi WTSI Modified SHIRPA / Limb Grasping HOM 0f:3m - 1.00 FAILED - Not enough mutant or control data
Slc25a29tm1a(KOMP)Wtsi WTSI Modified SHIRPA / Limb Grasping HOM 0f:3m - 1.00 FAILED - Not enough mutant or control data
Slc25a29tm1a(KOMP)Wtsi WTSI Modified SHIRPA / Limb Grasping HOM 7f:4m Fisher Exact Test framework 1.00 Not tested (No variation) - OK
Slc25a29tm1a(KOMP)Wtsi WTSI Modified SHIRPA / Limb Grasping HOM 7f:4m Fisher Exact Test framework 1.00 Not tested (No variation) - OK
Slc25a29tm1a(KOMP)Wtsi WTSI Modified SHIRPA / Corneal Reflex HOM 0f:3m - 1.00 FAILED - Not enough mutant or control data
Slc25a29tm1a(KOMP)Wtsi WTSI Modified SHIRPA / Corneal Reflex HOM 0f:3m - 1.00 FAILED - Not enough mutant or control data
Slc25a29tm1a(KOMP)Wtsi WTSI Modified SHIRPA / Corneal Reflex HOM 7f:4m Fisher Exact Test framework 1.00 Not tested (No variation) - OK
Slc25a29tm1a(KOMP)Wtsi WTSI Modified SHIRPA / Corneal Reflex HOM 7f:4m Fisher Exact Test framework 1.00 Not tested (No variation) - OK
Slc25a29tm1a(KOMP)Wtsi WTSI Dexa-scan analysis / Weight HOM 7f:4m Mixed Model framework, linear mixed-effects model, equation withoutWeight 0.653 Success
Slc25a29tm1a(KOMP)Wtsi WTSI Dexa-scan analysis / Weight HOM 7f:4m Mixed Model framework, linear mixed-effects model, equation withoutWeight 0.653 Success
Slc25a29tm1a(KOMP)Wtsi WTSI Dexa-scan analysis / Weight HOM 0f:3m Not processed 1.00 FAILED - Not enough mutant or control data
Slc25a29tm1a(KOMP)Wtsi WTSI Dexa-scan analysis / Weight HOM 0f:3m Not processed 1.00 FAILED - Not enough mutant or control data
Slc25a29tm1a(KOMP)Wtsi WTSI Dexa-scan analysis / Fat Mass HOM 7f:4m Mixed Model framework, linear mixed-effects model, equation withoutWeight 0.453 Success
Slc25a29tm1a(KOMP)Wtsi WTSI Dexa-scan analysis / Fat Mass HOM 7f:4m Mixed Model framework, linear mixed-effects model, equation withoutWeight 0.453 Success
Slc25a29tm1a(KOMP)Wtsi WTSI Dexa-scan analysis / Fat Mass HOM 0f:3m Not processed 1.00 FAILED - Not enough mutant or control data
Slc25a29tm1a(KOMP)Wtsi WTSI Dexa-scan analysis / Fat Mass HOM 0f:3m Not processed 1.00 FAILED - Not enough mutant or control data
Slc25a29tm1a(KOMP)Wtsi WTSI Dexa-scan analysis / Lean Mass HOM 7f:4m Mixed Model framework, linear mixed-effects model, equation withoutWeight 0.563 Success
Slc25a29tm1a(KOMP)Wtsi WTSI Dexa-scan analysis / Lean Mass HOM 7f:4m Mixed Model framework, linear mixed-effects model, equation withoutWeight 0.563 Success
Slc25a29tm1a(KOMP)Wtsi WTSI Dexa-scan analysis / Lean Mass HOM 0f:3m Not processed 1.00 FAILED - Not enough mutant or control data
Slc25a29tm1a(KOMP)Wtsi WTSI Dexa-scan analysis / Lean Mass HOM 0f:3m Not processed 1.00 FAILED - Not enough mutant or control data
Slc25a29tm1a(KOMP)Wtsi WTSI Dexa-scan analysis / Bone Mineral Density (excluding skull) HOM 7f:4m Mixed Model framework, linear mixed-effects model, equation withoutWeight 0.714 Success
Slc25a29tm1a(KOMP)Wtsi WTSI Dexa-scan analysis / Bone Mineral Density (excluding skull) HOM 7f:4m Mixed Model framework, linear mixed-effects model, equation withoutWeight 0.714 Success
Slc25a29tm1a(KOMP)Wtsi WTSI Dexa-scan analysis / Bone Mineral Density (excluding skull) HOM 0f:3m Not processed 1.00 FAILED - Not enough mutant or control data
Slc25a29tm1a(KOMP)Wtsi WTSI Dexa-scan analysis / Bone Mineral Density (excluding skull) HOM 0f:3m Not processed 1.00 FAILED - Not enough mutant or control data
Slc25a29tm1a(KOMP)Wtsi WTSI Dexa-scan analysis / Bone Mineral Content HOM 7f:4m Mixed Model framework, linear mixed-effects model, equation withoutWeight 0.960 Success
Slc25a29tm1a(KOMP)Wtsi WTSI Dexa-scan analysis / Bone Mineral Content HOM 7f:4m Mixed Model framework, linear mixed-effects model, equation withoutWeight 0.960 Success
Slc25a29tm1a(KOMP)Wtsi WTSI Dexa-scan analysis / Bone Mineral Content HOM 0f:3m Not processed 1.00 FAILED - Not enough mutant or control data
Slc25a29tm1a(KOMP)Wtsi WTSI Dexa-scan analysis / Bone Mineral Content HOM 0f:3m Not processed 1.00 FAILED - Not enough mutant or control data
Slc25a29tm1a(KOMP)Wtsi WTSI Dexa-scan analysis / Body Length HOM 7f:4m Mixed Model framework, linear mixed-effects model, equation withoutWeight 0.602 Success
Slc25a29tm1a(KOMP)Wtsi WTSI Dexa-scan analysis / Body Length HOM 7f:4m Mixed Model framework, linear mixed-effects model, equation withoutWeight 0.602 Success
Slc25a29tm1a(KOMP)Wtsi WTSI Dexa-scan analysis / Body Length HOM 0f:3m Not processed 1.00 FAILED - Not enough mutant or control data
Slc25a29tm1a(KOMP)Wtsi WTSI Dexa-scan analysis / Body Length HOM 0f:3m Not processed 1.00 FAILED - Not enough mutant or control data
Slc25a29tm1a(KOMP)Wtsi WTSI Dysmorphology / Head morphology HOM 7f:4m Fisher Exact Test framework 1.00 Not tested (No variation) - OK
Slc25a29tm1a(KOMP)Wtsi WTSI Dysmorphology / Head morphology HOM 0f:3m - 1.00 FAILED - Not enough mutant or control data
Slc25a29tm1a(KOMP)Wtsi WTSI Dysmorphology / Head morphology HOM 0f:3m - 1.00 FAILED - Not enough mutant or control data
Slc25a29tm1a(KOMP)Wtsi WTSI Dysmorphology / Head morphology HOM 7f:4m Fisher Exact Test framework 1.00 Not tested (No variation) - OK
Slc25a29tm1a(KOMP)Wtsi WTSI Dysmorphology / Head size HOM 7f:4m Fisher Exact Test framework 1.00 Not tested (No variation) - OK
Slc25a29tm1a(KOMP)Wtsi WTSI Dysmorphology / Head size HOM 0f:3m - 1.00 FAILED - Not enough mutant or control data
Slc25a29tm1a(KOMP)Wtsi WTSI Dysmorphology / Head size HOM 0f:3m - 1.00 FAILED - Not enough mutant or control data
Slc25a29tm1a(KOMP)Wtsi WTSI Dysmorphology / Head size HOM 7f:4m Fisher Exact Test framework 1.00 Not tested (No variation) - OK
Slc25a29tm1a(KOMP)Wtsi WTSI Dysmorphology / Skin pigmentation HOM 7f:4m Fisher Exact Test framework 0.768 Success
Slc25a29tm1a(KOMP)Wtsi WTSI Dysmorphology / Skin pigmentation HOM 7f:4m Fisher Exact Test framework 0.768 Success
Slc25a29tm1a(KOMP)Wtsi WTSI Dysmorphology / Skin pigmentation HOM 0f:3m - 1.00 FAILED - Not enough mutant or control data
Slc25a29tm1a(KOMP)Wtsi WTSI Dysmorphology / Skin pigmentation HOM 0f:3m - 1.00 FAILED - Not enough mutant or control data
Slc25a29tm1a(KOMP)Wtsi WTSI Dysmorphology / Skin condition HOM 7f:4m Fisher Exact Test framework 1.00 Success
Slc25a29tm1a(KOMP)Wtsi WTSI Dysmorphology / Skin condition HOM 0f:3m - 1.00 FAILED - Not enough mutant or control data
Slc25a29tm1a(KOMP)Wtsi WTSI Dysmorphology / Skin condition HOM 0f:3m - 1.00 FAILED - Not enough mutant or control data
Slc25a29tm1a(KOMP)Wtsi WTSI Dysmorphology / Skin condition HOM 7f:4m Fisher Exact Test framework 1.00 Success
Slc25a29tm1a(KOMP)Wtsi WTSI Modified SHIRPA / Evidence of Biting HOM 7f:4m Fisher Exact Test framework 0.0594 Success
Slc25a29tm1a(KOMP)Wtsi WTSI Modified SHIRPA / Evidence of Biting HOM 7f:4m Fisher Exact Test framework 0.0594 Success
Slc25a29tm1a(KOMP)Wtsi WTSI Modified SHIRPA / Evidence of Biting HOM 0f:3m - 1.00 FAILED - Not enough mutant or control data
Slc25a29tm1a(KOMP)Wtsi WTSI Modified SHIRPA / Evidence of Biting HOM 0f:3m - 1.00 FAILED - Not enough mutant or control data
Slc25a29tm1a(KOMP)Wtsi WTSI Buffy coat peripheral blood leukocyte immunophenotyping / Treg cell CD25+ percentage HOM 7f:4m Mixed Model framework, linear mixed-effects model, equation withoutWeight 0.458 Success
Slc25a29tm1a(KOMP)Wtsi WTSI Modified SHIRPA / Contact Righting Reflex HOM 0f:3m - 1.00 FAILED - Not enough mutant or control data
Slc25a29tm1a(KOMP)Wtsi WTSI Modified SHIRPA / Contact Righting Reflex HOM 0f:3m - 1.00 FAILED - Not enough mutant or control data
Slc25a29tm1a(KOMP)Wtsi WTSI Modified SHIRPA / Contact Righting Reflex HOM 7f:4m Fisher Exact Test framework 1.00 Not tested (No variation) - OK
Slc25a29tm1a(KOMP)Wtsi WTSI Modified SHIRPA / Contact Righting Reflex HOM 7f:4m Fisher Exact Test framework 1.00 Not tested (No variation) - OK
Slc25a29tm1a(KOMP)Wtsi WTSI Modified SHIRPA / Vocalization HOM 0f:3m - 1.00 FAILED - Not enough mutant or control data
Slc25a29tm1a(KOMP)Wtsi WTSI Modified SHIRPA / Vocalization HOM 0f:3m - 1.00 FAILED - Not enough mutant or control data
Slc25a29tm1a(KOMP)Wtsi WTSI Modified SHIRPA / Vocalization HOM 7f:4m Fisher Exact Test framework 1.00 Success
Slc25a29tm1a(KOMP)Wtsi WTSI Modified SHIRPA / Vocalization HOM 7f:4m Fisher Exact Test framework 1.00 Success
Slc25a29tm1a(KOMP)Wtsi WTSI Dysmorphology / Body fat distribution HOM 0f:3m - 1.00 FAILED - Not enough mutant or control data
Slc25a29tm1a(KOMP)Wtsi WTSI Dysmorphology / Body fat distribution HOM 0f:3m - 1.00 FAILED - Not enough mutant or control data
Slc25a29tm1a(KOMP)Wtsi WTSI Dysmorphology / Body fat distribution HOM 7f:4m Fisher Exact Test framework 1.00 Not tested (No variation) - OK
Slc25a29tm1a(KOMP)Wtsi WTSI Dysmorphology / Body fat distribution HOM 7f:4m Fisher Exact Test framework 1.00 Not tested (No variation) - OK
Slc25a29tm1a(KOMP)Wtsi WTSI Dysmorphology / Coat texture HOM 7f:4m Fisher Exact Test framework 0.754 Success
Slc25a29tm1a(KOMP)Wtsi WTSI Dysmorphology / Coat texture HOM 7f:4m Fisher Exact Test framework 0.754 Success
Slc25a29tm1a(KOMP)Wtsi WTSI Dysmorphology / Coat texture HOM 0f:3m - 1.00 FAILED - Not enough mutant or control data
Slc25a29tm1a(KOMP)Wtsi WTSI Dysmorphology / Coat texture HOM 0f:3m - 1.00 FAILED - Not enough mutant or control data
Slc25a29tm1a(KOMP)Wtsi WTSI Dysmorphology / Coat colouration HOM 7f:4m Fisher Exact Test framework 1.00 Success
Slc25a29tm1a(KOMP)Wtsi WTSI Dysmorphology / Coat colouration HOM 7f:4m Fisher Exact Test framework 1.00 Success
Slc25a29tm1a(KOMP)Wtsi WTSI Dysmorphology / Coat colouration HOM 0f:3m - 1.00 FAILED - Not enough mutant or control data
Slc25a29tm1a(KOMP)Wtsi WTSI Dysmorphology / Coat colouration HOM 0f:3m - 1.00 FAILED - Not enough mutant or control data
Slc25a29tm1a(KOMP)Wtsi WTSI Dysmorphology / Coat intact HOM 0f:3m - 1.00 FAILED - Not enough mutant or control data
Slc25a29tm1a(KOMP)Wtsi WTSI Dysmorphology / Coat intact HOM 0f:3m - 1.00 FAILED - Not enough mutant or control data
Slc25a29tm1a(KOMP)Wtsi WTSI Dysmorphology / Coat intact HOM 7f:4m Fisher Exact Test framework 1.00 Success
Slc25a29tm1a(KOMP)Wtsi WTSI Dysmorphology / Coat intact HOM 7f:4m Fisher Exact Test framework 1.00 Success
Slc25a29tm1a(KOMP)Wtsi WTSI Dysmorphology / Muscle development HOM 7f:4m Fisher Exact Test framework 1.00 Not tested (No variation) - OK
Slc25a29tm1a(KOMP)Wtsi WTSI Dysmorphology / Muscle development HOM 0f:3m - 1.00 FAILED - Not enough mutant or control data
Slc25a29tm1a(KOMP)Wtsi WTSI Dysmorphology / Muscle development HOM 0f:3m - 1.00 FAILED - Not enough mutant or control data
Slc25a29tm1a(KOMP)Wtsi WTSI Dysmorphology / Muscle development HOM 7f:4m Fisher Exact Test framework 1.00 Not tested (No variation) - OK

 Expression

IMPC lacZ Expression Data

 Expression  No Expression  Ambiguous  No Tissue Available
Anatomy #HET Specimens HOM Images? WT Expr Mutant Expr Images
Adrenal gland 3 No  (2/584) N/A
Aorta 3 No N/A
Blood vessel 3 No N/A
Bone 3 No N/A
Brain 3 No  (2/3) N/A
Brainstem 3 No N/A
Brown adipose tissue 3 No N/A
Cartilage tissue 3 No N/A
Cerebellum 3 No N/A
Cerebral cortex 3 No N/A
Eye 3 No N/A
Gall bladder 3 No N/A
Heart 3 No N/A
Hippocampus 3 No N/A
Hypothalamus 3 No N/A
Kidney 3 No  (18/584)  (2/3) N/A
Large intestine 3 No  (10/584) N/A
Liver 3 No N/A
Lower urinary tract 3 No  (1/3) N/A
Lung 3 No N/A
Lymph node 3 No N/A
Mammary gland 3 No N/A
Esophagus 3 No N/A
Olfactory lobe 3 No N/A
Ovary 3 No  (1/584)  (1/3) N/A
Oviduct 3 No N/A
Pancreas 3 No  (5/584) N/A
Parathyroid gland 3 No N/A
Peripheral nervous system 3 No N/A
Peyer's patch 3 No N/A
Pituitary gland 3 No N/A
Prostate gland 3 No  (12/584)  (1/3) N/A
Skeletal muscle tissue 3 No N/A
Skin 3 No N/A
Small intestine 3 No  (9/584) N/A
Spinal cord 3 No N/A
Spleen 3 No  (2/584) N/A
Stomach 3 No  (12/584) N/A
Striatum 3 No N/A
Testis 3 No  (2/584)  (1/3) N/A
Thymus 3 No N/A
Thyroid gland 3 No  (15/584) N/A
Trachea 3 No N/A
Uterus 3 No N/A
White adipose tissue 3 No N/A
No Embryo expression data was found for this gene.

 Associated Images

Phenotype associated images not available

 Disease Models

No associations by disease annotation and gene orthology found.
Please visit the desktop version to see this section

 Order Mouse and ES Cells

MGI Allele Allele Type Availability
Slc25a29tm1a(KOMP)Wtsi KO first allele (reporter-tagged insertion with conditional potential) Mice, Targeting vectors, ES Cells
Slc25a29tm1(KOMP)Vlcg Reporter-tagged deletion allele (with selection cassette) Targeting vectors, ES Cells

The IMPC Newsletter

Get highlights of the most important data releases, news and events, delivered straight to your email inbox

Subscribe to newsletter