Gene: Sgo2a

Name
shugoshin 2A
MGI ID
MGI:1098767
Synonyms
Sgol2a 1110007N04Rik 5730576N04Rik D1Ertd8e Tripin Sgol2
Viability
Homozygous - Viable
Other links
View data by physiological system
Significant
Not Significant
Not tested

Filtered by: all phenotypes

Mouseover the data points for more information. Click and drag to zoom the chart. Click on the legends to disable/enable data.

Allele Center Procedure / Parameter Zygosity Mutants Statistical
Method
P Value Status
Sgo2atm1a(EUCOMM)Wtsi WTSI Open Field / Number of entries in the center HOM 7f:9m Mixed Model framework, linear mixed-effects model, equation withoutWeight 0.562 Success
Sgo2atm1a(EUCOMM)Wtsi WTSI Open Field / Number of entries in the center HOM 7f:9m Mixed Model framework, linear mixed-effects model, equation withoutWeight 0.562 Success
Sgo2atm1a(EUCOMM)Wtsi WTSI Open Field / Number of entries in the center HOM 3f:0m Not processed 1.00 FAILED - Not enough mutant or control data
Sgo2atm1a(EUCOMM)Wtsi WTSI Open Field / Number of entries in the center HOM 3f:0m Not processed 1.00 FAILED - Not enough mutant or control data
Sgo2atm1a(EUCOMM)Wtsi WTSI Open Field / Latency to enter in the center HOM 7f:9m Mixed Model framework, generalized least squares, equation withoutWeight 0.0295 Success
Sgo2atm1a(EUCOMM)Wtsi WTSI Open Field / Latency to enter in the center HOM 7f:9m Mixed Model framework, generalized least squares, equation withoutWeight 0.0295 Success
Sgo2atm1a(EUCOMM)Wtsi WTSI Open Field / Latency to enter in the center HOM 3f:0m Not processed 1.00 FAILED - Not enough mutant or control data
Sgo2atm1a(EUCOMM)Wtsi WTSI Open Field / Latency to enter in the center HOM 3f:0m Not processed 1.00 FAILED - Not enough mutant or control data
Sgo2atm1a(EUCOMM)Wtsi WTSI Open Field / center - resting time HOM 7f:9m Mixed Model framework, generalized least squares, equation withoutWeight 0.329 Success
Sgo2atm1a(EUCOMM)Wtsi WTSI Open Field / center - resting time HOM 7f:9m Mixed Model framework, generalized least squares, equation withoutWeight 0.329 Success
Sgo2atm1a(EUCOMM)Wtsi WTSI Open Field / center - resting time HOM 3f:0m Not processed 1.00 FAILED - Not enough mutant or control data
Sgo2atm1a(EUCOMM)Wtsi WTSI Open Field / center - resting time HOM 3f:0m Not processed 1.00 FAILED - Not enough mutant or control data
Sgo2atm1a(EUCOMM)Wtsi WTSI Open Field / center - distance HOM 7f:9m Mixed Model framework, linear mixed-effects model, equation withoutWeight 0.398 Success
Sgo2atm1a(EUCOMM)Wtsi WTSI Open Field / center - distance HOM 7f:9m Mixed Model framework, linear mixed-effects model, equation withoutWeight 0.398 Success
Sgo2atm1a(EUCOMM)Wtsi WTSI Open Field / center - distance HOM 3f:0m Not processed 1.00 FAILED - Not enough mutant or control data
Sgo2atm1a(EUCOMM)Wtsi WTSI Open Field / center - distance HOM 3f:0m Not processed 1.00 FAILED - Not enough mutant or control data
Sgo2atm1a(EUCOMM)Wtsi WTSI Open Field / center - average Speed HOM 7f:9m Mixed Model framework, generalized least squares, equation withoutWeight 0.183 Success
Sgo2atm1a(EUCOMM)Wtsi WTSI Open Field / center - average Speed HOM 7f:9m Mixed Model framework, generalized least squares, equation withoutWeight 0.183 Success
Sgo2atm1a(EUCOMM)Wtsi WTSI Open Field / center - average Speed HOM 3f:0m Not processed 1.00 FAILED - Not enough mutant or control data
Sgo2atm1a(EUCOMM)Wtsi WTSI Open Field / center - average Speed HOM 3f:0m Not processed 1.00 FAILED - Not enough mutant or control data
Sgo2atm1a(EUCOMM)Wtsi WTSI Open Field / center - permanence time HOM 7f:9m Mixed Model framework, generalized least squares, equation withoutWeight 0.352 Success
Sgo2atm1a(EUCOMM)Wtsi WTSI Open Field / center - permanence time HOM 7f:9m Mixed Model framework, generalized least squares, equation withoutWeight 0.352 Success
Sgo2atm1a(EUCOMM)Wtsi WTSI Open Field / center - permanence time HOM 3f:0m Not processed 1.00 FAILED - Not enough mutant or control data
Sgo2atm1a(EUCOMM)Wtsi WTSI Open Field / center - permanence time HOM 3f:0m Not processed 1.00 FAILED - Not enough mutant or control data
Sgo2atm1a(EUCOMM)Wtsi WTSI Haematology test / Haemoglobin HOM 7f:9m Mixed Model framework, linear mixed-effects model, equation withoutWeight 0.127 Success
Sgo2atm1a(EUCOMM)Wtsi WTSI Haematology test / Haemoglobin HOM 7f:9m Mixed Model framework, linear mixed-effects model, equation withoutWeight 0.127 Success
Sgo2atm1a(EUCOMM)Wtsi WTSI Haematology test / Haemoglobin HOM 3f:0m Not processed 1.00 FAILED - Not enough mutant or control data
Sgo2atm1a(EUCOMM)Wtsi WTSI Haematology test / Haemoglobin HOM 3f:0m Not processed 1.00 FAILED - Not enough mutant or control data
Sgo2atm1a(EUCOMM)Wtsi WTSI Haematology test / Haematocrit HOM 7f:9m Mixed Model framework, linear mixed-effects model, equation withoutWeight 0.0390 Success
Sgo2atm1a(EUCOMM)Wtsi WTSI Haematology test / Haematocrit HOM 7f:9m Mixed Model framework, linear mixed-effects model, equation withoutWeight 0.0390 Success
Sgo2atm1a(EUCOMM)Wtsi WTSI Haematology test / Haematocrit HOM 3f:0m Not processed 1.00 FAILED - Not enough mutant or control data
Sgo2atm1a(EUCOMM)Wtsi WTSI Haematology test / Haematocrit HOM 3f:0m Not processed 1.00 FAILED - Not enough mutant or control data
Sgo2atm1a(EUCOMM)Wtsi WTSI Haematology test / White blood cell-count HOM 7f:9m Mixed Model framework, linear mixed-effects model, equation withoutWeight 0.0797 Success
Sgo2atm1a(EUCOMM)Wtsi WTSI Haematology test / White blood cell-count HOM 7f:9m Mixed Model framework, linear mixed-effects model, equation withoutWeight 0.0797 Success
Sgo2atm1a(EUCOMM)Wtsi WTSI Haematology test / White blood cell-count HOM 3f:0m Not processed 1.00 FAILED - Not enough mutant or control data
Sgo2atm1a(EUCOMM)Wtsi WTSI Haematology test / White blood cell-count HOM 3f:0m Not processed 1.00 FAILED - Not enough mutant or control data
Sgo2atm1a(EUCOMM)Wtsi WTSI Haematology test / Red Blood Cell-count HOM 7f:9m Mixed Model framework, linear mixed-effects model, equation withoutWeight 0.0155 Success
Sgo2atm1a(EUCOMM)Wtsi WTSI Haematology test / Red Blood Cell-count HOM 7f:9m Mixed Model framework, linear mixed-effects model, equation withoutWeight 0.0155 Success
Sgo2atm1a(EUCOMM)Wtsi WTSI Haematology test / Red Blood Cell-count HOM 3f:0m Not processed 1.00 FAILED - Not enough mutant or control data
Sgo2atm1a(EUCOMM)Wtsi WTSI Haematology test / Red Blood Cell-count HOM 3f:0m Not processed 1.00 FAILED - Not enough mutant or control data
Sgo2atm1a(EUCOMM)Wtsi WTSI Haematology test / Mean-cell-haemoglobin-conc HOM 7f:9m Mixed Model framework, linear mixed-effects model, equation withoutWeight 0.728 Success
Sgo2atm1a(EUCOMM)Wtsi WTSI Haematology test / Mean-cell-haemoglobin-conc HOM 7f:9m Mixed Model framework, linear mixed-effects model, equation withoutWeight 0.728 Success
Sgo2atm1a(EUCOMM)Wtsi WTSI Haematology test / Mean-cell-haemoglobin-conc HOM 3f:0m Not processed 1.00 FAILED - Not enough mutant or control data
Sgo2atm1a(EUCOMM)Wtsi WTSI Haematology test / Mean-cell-haemoglobin-conc HOM 3f:0m Not processed 1.00 FAILED - Not enough mutant or control data
Sgo2atm1a(EUCOMM)Wtsi WTSI Haematology test / Platelets-count HOM 7f:9m Mixed Model framework, linear mixed-effects model, equation withoutWeight 0.482 Success
Sgo2atm1a(EUCOMM)Wtsi WTSI Haematology test / Platelets-count HOM 7f:9m Mixed Model framework, linear mixed-effects model, equation withoutWeight 0.482 Success
Sgo2atm1a(EUCOMM)Wtsi WTSI Haematology test / Platelets-count HOM 3f:0m Not processed 1.00 FAILED - Not enough mutant or control data
Sgo2atm1a(EUCOMM)Wtsi WTSI Haematology test / Platelets-count HOM 3f:0m Not processed 1.00 FAILED - Not enough mutant or control data
Sgo2atm1a(EUCOMM)Wtsi WTSI Haematology test / Mean-cell-volume HOM 7f:9m Mixed Model framework, linear mixed-effects model, equation withoutWeight 0.821 Success
Sgo2atm1a(EUCOMM)Wtsi WTSI Haematology test / Mean-cell-volume HOM 7f:9m Mixed Model framework, linear mixed-effects model, equation withoutWeight 0.821 Success
Sgo2atm1a(EUCOMM)Wtsi WTSI Haematology test / Mean-cell-volume HOM 3f:0m Not processed 1.00 FAILED - Not enough mutant or control data
Sgo2atm1a(EUCOMM)Wtsi WTSI Haematology test / Mean-cell-volume HOM 3f:0m Not processed 1.00 FAILED - Not enough mutant or control data
Sgo2atm1a(EUCOMM)Wtsi WTSI Haematology test / Mean-corpuscular-haemoglobin HOM 7f:9m Mixed Model framework, linear mixed-effects model, equation withoutWeight 0.986 Success
Sgo2atm1a(EUCOMM)Wtsi WTSI Haematology test / Mean-corpuscular-haemoglobin HOM 7f:9m Mixed Model framework, linear mixed-effects model, equation withoutWeight 0.986 Success
Sgo2atm1a(EUCOMM)Wtsi WTSI Haematology test / Mean-corpuscular-haemoglobin HOM 3f:0m Not processed 1.00 FAILED - Not enough mutant or control data
Sgo2atm1a(EUCOMM)Wtsi WTSI Haematology test / Mean-corpuscular-haemoglobin HOM 3f:0m Not processed 1.00 FAILED - Not enough mutant or control data
Sgo2atm1a(EUCOMM)Wtsi WTSI Clinical Chemistry / Chloride HOM 7f:8m Mixed Model framework, linear mixed-effects model, equation withoutWeight 0.216 Success
Sgo2atm1a(EUCOMM)Wtsi WTSI Clinical Chemistry / Chloride HOM 7f:8m Mixed Model framework, linear mixed-effects model, equation withoutWeight 0.216 Success
Sgo2atm1a(EUCOMM)Wtsi WTSI Clinical Chemistry / Chloride HOM 3f:0m Not processed 1.00 FAILED - Not enough mutant or control data
Sgo2atm1a(EUCOMM)Wtsi WTSI Clinical Chemistry / Chloride HOM 3f:0m Not processed 1.00 FAILED - Not enough mutant or control data
Sgo2atm1a(EUCOMM)Wtsi WTSI Clinical Chemistry / Chloride HOM 0f:1m Not processed 1.00 FAILED - Not enough mutant or control data
Sgo2atm1a(EUCOMM)Wtsi WTSI Clinical Chemistry / Chloride HOM 0f:1m Not processed 1.00 FAILED - Not enough mutant or control data
Sgo2atm1a(EUCOMM)Wtsi WTSI Clinical Chemistry / Potassium HOM 7f:8m Mixed Model framework, linear mixed-effects model, equation withoutWeight 0.934 Success
Sgo2atm1a(EUCOMM)Wtsi WTSI Clinical Chemistry / Potassium HOM 7f:8m Mixed Model framework, linear mixed-effects model, equation withoutWeight 0.934 Success
Sgo2atm1a(EUCOMM)Wtsi WTSI Clinical Chemistry / Potassium HOM 3f:0m Not processed 1.00 FAILED - Not enough mutant or control data
Sgo2atm1a(EUCOMM)Wtsi WTSI Clinical Chemistry / Potassium HOM 3f:0m Not processed 1.00 FAILED - Not enough mutant or control data
Sgo2atm1a(EUCOMM)Wtsi WTSI Clinical Chemistry / Potassium HOM 0f:1m Not processed 1.00 FAILED - Not enough mutant or control data
Sgo2atm1a(EUCOMM)Wtsi WTSI Clinical Chemistry / Potassium HOM 0f:1m Not processed 1.00 FAILED - Not enough mutant or control data
Sgo2atm1a(EUCOMM)Wtsi WTSI Clinical Chemistry / Sodium HOM 7f:8m Mixed Model framework, linear mixed-effects model, equation withoutWeight 0.309 Success
Sgo2atm1a(EUCOMM)Wtsi WTSI Clinical Chemistry / Sodium HOM 7f:8m Mixed Model framework, linear mixed-effects model, equation withoutWeight 0.309 Success
Sgo2atm1a(EUCOMM)Wtsi WTSI Clinical Chemistry / Sodium HOM 3f:0m Not processed 1.00 FAILED - Not enough mutant or control data
Sgo2atm1a(EUCOMM)Wtsi WTSI Clinical Chemistry / Sodium HOM 3f:0m Not processed 1.00 FAILED - Not enough mutant or control data
Sgo2atm1a(EUCOMM)Wtsi WTSI Clinical Chemistry / Sodium HOM 0f:1m Not processed 1.00 FAILED - Not enough mutant or control data
Sgo2atm1a(EUCOMM)Wtsi WTSI Clinical Chemistry / Sodium HOM 0f:1m Not processed 1.00 FAILED - Not enough mutant or control data
Sgo2atm1a(EUCOMM)Wtsi WTSI Clinical Chemistry / Creatinine HOM 7f:8m Mixed Model framework, linear mixed-effects model, equation withoutWeight 0.00122 Success
Sgo2atm1a(EUCOMM)Wtsi WTSI Clinical Chemistry / Creatinine HOM 7f:8m Mixed Model framework, linear mixed-effects model, equation withoutWeight 0.00122 Success
Sgo2atm1a(EUCOMM)Wtsi WTSI Clinical Chemistry / Creatinine HOM 3f:0m Not processed 1.00 FAILED - Not enough mutant or control data
Sgo2atm1a(EUCOMM)Wtsi WTSI Clinical Chemistry / Creatinine HOM 3f:0m Not processed 1.00 FAILED - Not enough mutant or control data
Sgo2atm1a(EUCOMM)Wtsi WTSI Clinical Chemistry / Creatinine HOM 0f:1m Not processed 1.00 FAILED - Not enough mutant or control data
Sgo2atm1a(EUCOMM)Wtsi WTSI Clinical Chemistry / Creatinine HOM 0f:1m Not processed 1.00 FAILED - Not enough mutant or control data
Sgo2atm1a(EUCOMM)Wtsi WTSI Clinical Chemistry / Urea HOM 7f:8m Mixed Model framework, linear mixed-effects model, equation withoutWeight 0.0593 Success
Sgo2atm1a(EUCOMM)Wtsi WTSI Clinical Chemistry / Urea HOM 7f:8m Mixed Model framework, linear mixed-effects model, equation withoutWeight 0.0593 Success
Sgo2atm1a(EUCOMM)Wtsi WTSI Clinical Chemistry / Urea HOM 3f:0m Not processed 1.00 FAILED - Not enough mutant or control data
Sgo2atm1a(EUCOMM)Wtsi WTSI Clinical Chemistry / Urea HOM 3f:0m Not processed 1.00 FAILED - Not enough mutant or control data
Sgo2atm1a(EUCOMM)Wtsi WTSI Clinical Chemistry / Urea HOM 0f:1m Not processed 1.00 FAILED - Not enough mutant or control data
Sgo2atm1a(EUCOMM)Wtsi WTSI Clinical Chemistry / Urea HOM 0f:1m Not processed 1.00 FAILED - Not enough mutant or control data
Sgo2atm1a(EUCOMM)Wtsi WTSI Buffy coat peripheral blood leukocyte immunophenotyping / Monocyte percentage HOM 7f:9m Mixed Model framework, linear mixed-effects model, equation withoutWeight 0.963 Success
Sgo2atm1a(EUCOMM)Wtsi WTSI Clinical Chemistry / Glucose HOM 7f:8m Mixed Model framework, linear mixed-effects model, equation withoutWeight 0.654 Success
Sgo2atm1a(EUCOMM)Wtsi WTSI Clinical Chemistry / Glucose HOM 7f:8m Mixed Model framework, linear mixed-effects model, equation withoutWeight 0.654 Success
Sgo2atm1a(EUCOMM)Wtsi WTSI Clinical Chemistry / Glucose HOM 3f:0m Not processed 1.00 FAILED - Not enough mutant or control data
Sgo2atm1a(EUCOMM)Wtsi WTSI Clinical Chemistry / Glucose HOM 3f:0m Not processed 1.00 FAILED - Not enough mutant or control data
Sgo2atm1a(EUCOMM)Wtsi WTSI Clinical Chemistry / Glucose HOM 0f:1m Not processed 1.00 FAILED - Not enough mutant or control data
Sgo2atm1a(EUCOMM)Wtsi WTSI Clinical Chemistry / Glucose HOM 0f:1m Not processed 1.00 FAILED - Not enough mutant or control data
Sgo2atm1a(EUCOMM)Wtsi WTSI Clinical Chemistry / Calcium HOM 7f:8m Mixed Model framework, linear mixed-effects model, equation withoutWeight 0.00616 Success
Sgo2atm1a(EUCOMM)Wtsi WTSI Clinical Chemistry / Calcium HOM 7f:8m Mixed Model framework, linear mixed-effects model, equation withoutWeight 0.00616 Success
Sgo2atm1a(EUCOMM)Wtsi WTSI Clinical Chemistry / Calcium HOM 3f:0m Not processed 1.00 FAILED - Not enough mutant or control data
Sgo2atm1a(EUCOMM)Wtsi WTSI Clinical Chemistry / Calcium HOM 3f:0m Not processed 1.00 FAILED - Not enough mutant or control data
Sgo2atm1a(EUCOMM)Wtsi WTSI Clinical Chemistry / Calcium HOM 0f:1m Not processed 1.00 FAILED - Not enough mutant or control data
Sgo2atm1a(EUCOMM)Wtsi WTSI Clinical Chemistry / Calcium HOM 0f:1m Not processed 1.00 FAILED - Not enough mutant or control data
Sgo2atm1a(EUCOMM)Wtsi WTSI Buffy coat peripheral blood leukocyte immunophenotyping / CD8+CD44+CD62L- percentage HOM 7f:9m Mixed Model framework, linear mixed-effects model, equation withoutWeight 0.0744 Success
Sgo2atm1a(EUCOMM)Wtsi WTSI Clinical Chemistry / Albumin HOM 7f:8m Mixed Model framework, linear mixed-effects model, equation withoutWeight 0.181 Success
Sgo2atm1a(EUCOMM)Wtsi WTSI Clinical Chemistry / Albumin HOM 7f:8m Mixed Model framework, linear mixed-effects model, equation withoutWeight 0.181 Success
Sgo2atm1a(EUCOMM)Wtsi WTSI Clinical Chemistry / Albumin HOM 3f:0m Not processed 1.00 FAILED - Not enough mutant or control data
Sgo2atm1a(EUCOMM)Wtsi WTSI Clinical Chemistry / Albumin HOM 3f:0m Not processed 1.00 FAILED - Not enough mutant or control data
Sgo2atm1a(EUCOMM)Wtsi WTSI Clinical Chemistry / Albumin HOM 0f:1m Not processed 1.00 FAILED - Not enough mutant or control data
Sgo2atm1a(EUCOMM)Wtsi WTSI Clinical Chemistry / Albumin HOM 0f:1m Not processed 1.00 FAILED - Not enough mutant or control data
Sgo2atm1a(EUCOMM)Wtsi WTSI Clinical Chemistry / Total protein HOM 7f:8m Mixed Model framework, linear mixed-effects model, equation withoutWeight 0.261 Success
Sgo2atm1a(EUCOMM)Wtsi WTSI Clinical Chemistry / Total protein HOM 7f:8m Mixed Model framework, linear mixed-effects model, equation withoutWeight 0.261 Success
Sgo2atm1a(EUCOMM)Wtsi WTSI Clinical Chemistry / Total protein HOM 3f:0m Not processed 1.00 FAILED - Not enough mutant or control data
Sgo2atm1a(EUCOMM)Wtsi WTSI Clinical Chemistry / Total protein HOM 3f:0m Not processed 1.00 FAILED - Not enough mutant or control data
Sgo2atm1a(EUCOMM)Wtsi WTSI Clinical Chemistry / Total protein HOM 0f:1m Not processed 1.00 FAILED - Not enough mutant or control data
Sgo2atm1a(EUCOMM)Wtsi WTSI Clinical Chemistry / Total protein HOM 0f:1m Not processed 1.00 FAILED - Not enough mutant or control data
Sgo2atm1a(EUCOMM)Wtsi WTSI Antigen Specific Immunoglobulin Assay / TetC specific total IgG HOM 3f:0m Not processed 1.00 FAILED - Not enough mutant or control data
Sgo2atm1a(EUCOMM)Wtsi WTSI Heart Dissection / Body Weight HOM 7f:9m Mixed Model framework, linear mixed-effects model, equation withoutWeight 0.0379 Success
Sgo2atm1a(EUCOMM)Wtsi WTSI Heart Dissection / Body Weight HOM 7f:9m Mixed Model framework, linear mixed-effects model, equation withoutWeight 0.0379 Success
Sgo2atm1a(EUCOMM)Wtsi WTSI Heart Dissection / Body Weight HOM 3f:0m Not processed 1.00 FAILED - Not enough mutant or control data
Sgo2atm1a(EUCOMM)Wtsi WTSI Heart Dissection / Body Weight HOM 3f:0m Not processed 1.00 FAILED - Not enough mutant or control data
Sgo2atm1a(EUCOMM)Wtsi WTSI Heart Dissection / Tibia Length HOM 3f:0m Not processed 1.00 FAILED - Not enough mutant or control data
Sgo2atm1a(EUCOMM)Wtsi WTSI Heart Dissection / Tibia Length HOM 3f:0m Not processed 1.00 FAILED - Not enough mutant or control data
Sgo2atm1a(EUCOMM)Wtsi WTSI Heart Dissection / Heart weight HOM 7f:9m Mixed Model framework, linear mixed-effects model, equation withoutWeight 0.992 Success
Sgo2atm1a(EUCOMM)Wtsi WTSI Heart Dissection / Heart weight HOM 7f:9m Mixed Model framework, linear mixed-effects model, equation withoutWeight 0.992 Success
Sgo2atm1a(EUCOMM)Wtsi WTSI Heart Dissection / Heart weight HOM 3f:0m Not processed 1.00 FAILED - Not enough mutant or control data
Sgo2atm1a(EUCOMM)Wtsi WTSI Heart Dissection / Heart weight HOM 3f:0m Not processed 1.00 FAILED - Not enough mutant or control data
Sgo2atm1a(EUCOMM)Wtsi WTSI Open Field / Periphery - Permanence Time HOM 7f:9m Mixed Model framework, generalized least squares, equation withoutWeight 0.353 Success
Sgo2atm1a(EUCOMM)Wtsi WTSI Open Field / Periphery - Permanence Time HOM 7f:9m Mixed Model framework, generalized least squares, equation withoutWeight 0.353 Success
Sgo2atm1a(EUCOMM)Wtsi WTSI Open Field / Periphery - Permanence Time HOM 3f:0m Not processed 1.00 FAILED - Not enough mutant or control data
Sgo2atm1a(EUCOMM)Wtsi WTSI Open Field / Periphery - Permanence Time HOM 3f:0m Not processed 1.00 FAILED - Not enough mutant or control data
Sgo2atm1a(EUCOMM)Wtsi WTSI Open Field / Periphery - resting time HOM 7f:9m Mixed Model framework, linear mixed-effects model, equation withoutWeight 0.759 Success
Sgo2atm1a(EUCOMM)Wtsi WTSI Open Field / Periphery - resting time HOM 7f:9m Mixed Model framework, linear mixed-effects model, equation withoutWeight 0.759 Success
Sgo2atm1a(EUCOMM)Wtsi WTSI Open Field / Periphery - resting time HOM 3f:0m Not processed 1.00 FAILED - Not enough mutant or control data
Sgo2atm1a(EUCOMM)Wtsi WTSI Open Field / Periphery - resting time HOM 3f:0m Not processed 1.00 FAILED - Not enough mutant or control data
Sgo2atm1a(EUCOMM)Wtsi WTSI Heart Dissection / Visual abnormality HOM 7f:9m Fisher Exact Test framework 1.00 Not tested (No variation) - OK
Sgo2atm1a(EUCOMM)Wtsi WTSI Heart Dissection / Visual abnormality HOM 3f:0m - 1.00 FAILED - Not enough mutant or control data
Sgo2atm1a(EUCOMM)Wtsi WTSI Heart Dissection / Visual abnormality HOM 7f:9m Fisher Exact Test framework 1.00 Not tested (No variation) - OK
Sgo2atm1a(EUCOMM)Wtsi WTSI Heart Dissection / Visual abnormality HOM 3f:0m - 1.00 FAILED - Not enough mutant or control data
Sgo2atm1a(EUCOMM)Wtsi WTSI Heart Dissection / Histology abnormality HOM 3f:0m Not processed 1.00 FAILED - Not enough mutant or control data
Sgo2atm1a(EUCOMM)Wtsi WTSI Heart Dissection / Histology abnormality HOM 3f:0m Not processed 1.00 FAILED - Not enough mutant or control data
Sgo2atm1a(EUCOMM)Wtsi WTSI Open Field / Periphery - average Speed HOM 7f:9m Mixed Model framework, linear mixed-effects model, equation withoutWeight 0.609 Success
Sgo2atm1a(EUCOMM)Wtsi WTSI Open Field / Periphery - average Speed HOM 7f:9m Mixed Model framework, linear mixed-effects model, equation withoutWeight 0.609 Success
Sgo2atm1a(EUCOMM)Wtsi WTSI Open Field / Periphery - average Speed HOM 3f:0m Not processed 1.00 FAILED - Not enough mutant or control data
Sgo2atm1a(EUCOMM)Wtsi WTSI Open Field / Periphery - average Speed HOM 3f:0m Not processed 1.00 FAILED - Not enough mutant or control data
Sgo2atm1a(EUCOMM)Wtsi WTSI Open Field / Whole Arena - Permanence Time HOM 7f:9m Not processed 1.00 FAILED - No variability in dependent variable 'M.G.P_007_001_004'.
Sgo2atm1a(EUCOMM)Wtsi WTSI Open Field / Whole Arena - Permanence Time HOM 7f:9m Not processed 1.00 FAILED - No variability in dependent variable 'M.G.P_007_001_004'.
Sgo2atm1a(EUCOMM)Wtsi WTSI Open Field / Whole Arena - Permanence Time HOM 3f:0m Not processed 1.00 FAILED - Not enough mutant or control data
Sgo2atm1a(EUCOMM)Wtsi WTSI Open Field / Whole Arena - Permanence Time HOM 3f:0m Not processed 1.00 FAILED - Not enough mutant or control data
Sgo2atm1a(EUCOMM)Wtsi WTSI Open Field / Whole Arena - resting time HOM 7f:9m Mixed Model framework, linear mixed-effects model, equation withoutWeight 0.829 Success
Sgo2atm1a(EUCOMM)Wtsi WTSI Open Field / Whole Arena - resting time HOM 7f:9m Mixed Model framework, linear mixed-effects model, equation withoutWeight 0.829 Success
Sgo2atm1a(EUCOMM)Wtsi WTSI Open Field / Whole Arena - resting time HOM 3f:0m Not processed 1.00 FAILED - Not enough mutant or control data
Sgo2atm1a(EUCOMM)Wtsi WTSI Open Field / Whole Arena - resting time HOM 3f:0m Not processed 1.00 FAILED - Not enough mutant or control data
Sgo2atm1a(EUCOMM)Wtsi WTSI Open Field / Periphery - distance HOM 7f:9m Mixed Model framework, linear mixed-effects model, equation withoutWeight 0.948 Success
Sgo2atm1a(EUCOMM)Wtsi WTSI Open Field / Periphery - distance HOM 7f:9m Mixed Model framework, linear mixed-effects model, equation withoutWeight 0.948 Success
Sgo2atm1a(EUCOMM)Wtsi WTSI Open Field / Periphery - distance HOM 3f:0m Not processed 1.00 FAILED - Not enough mutant or control data
Sgo2atm1a(EUCOMM)Wtsi WTSI Open Field / Periphery - distance HOM 3f:0m Not processed 1.00 FAILED - Not enough mutant or control data
Sgo2atm1a(EUCOMM)Wtsi WTSI Open Field / Whole Arena - average Speed HOM 7f:9m Mixed Model framework, linear mixed-effects model, equation withoutWeight 0.400 Success
Sgo2atm1a(EUCOMM)Wtsi WTSI Open Field / Whole Arena - average Speed HOM 7f:9m Mixed Model framework, linear mixed-effects model, equation withoutWeight 0.400 Success
Sgo2atm1a(EUCOMM)Wtsi WTSI Open Field / Whole Arena - average Speed HOM 3f:0m Not processed 1.00 FAILED - Not enough mutant or control data
Sgo2atm1a(EUCOMM)Wtsi WTSI Open Field / Whole Arena - average Speed HOM 3f:0m Not processed 1.00 FAILED - Not enough mutant or control data
Sgo2atm1a(EUCOMM)Wtsi WTSI Viability Primary Screen / Outcome HOM 242f:277m Supplied as data Success
Sgo2atm1a(EUCOMM)Wtsi WTSI Buffy coat peripheral blood leukocyte immunophenotyping / T cell CD8+ percentage HOM 7f:9m Mixed Model framework, linear mixed-effects model, equation withoutWeight 0.427 Success
Sgo2atm1a(EUCOMM)Wtsi WTSI Buffy coat peripheral blood leukocyte immunophenotyping / NK cell percentage HOM 7f:9m Mixed Model framework, linear mixed-effects model, equation withoutWeight 0.0275 Success
Sgo2atm1a(EUCOMM)Wtsi WTSI IPGTT / Body Weight HOM 0f:5m Mixed Model framework, generalized least squares, equation withoutWeight 0.102 Success
Sgo2atm1a(EUCOMM)Wtsi WTSI IPGTT / Body Weight HOM 0f:5m Mixed Model framework, generalized least squares, equation withoutWeight 0.102 Success
Sgo2atm1a(EUCOMM)Wtsi WTSI IPGTT / Body Weight HOM 3f:0m Not processed 1.00 FAILED - Not enough mutant or control data
Sgo2atm1a(EUCOMM)Wtsi WTSI IPGTT / Body Weight HOM 3f:0m Not processed 1.00 FAILED - Not enough mutant or control data
Sgo2atm1a(EUCOMM)Wtsi WTSI Buffy coat peripheral blood leukocyte immunophenotyping / Granulocyte Gr1+ percentage HOM 7f:9m Mixed Model framework, linear mixed-effects model, equation withoutWeight 0.101 Success
Sgo2atm1a(EUCOMM)Wtsi WTSI Ophthalmoscope / Left Retina Structure HOM 7f:9m Fisher Exact Test framework 1.00 Not tested (No variation) - OK
Sgo2atm1a(EUCOMM)Wtsi WTSI Ophthalmoscope / Left Retina Structure HOM 3f:0m - 1.00 FAILED - Not enough mutant or control data
Sgo2atm1a(EUCOMM)Wtsi WTSI Ophthalmoscope / Left Retina Structure HOM 7f:9m Fisher Exact Test framework 1.00 Not tested (No variation) - OK
Sgo2atm1a(EUCOMM)Wtsi WTSI Ophthalmoscope / Left Retina Structure HOM 3f:0m - 1.00 FAILED - Not enough mutant or control data
Sgo2atm1a(EUCOMM)Wtsi WTSI Ophthalmoscope / Left Retina Pigmentation HOM 3f:0m - 1.00 FAILED - Not enough mutant or control data
Sgo2atm1a(EUCOMM)Wtsi WTSI Ophthalmoscope / Left Retina Pigmentation HOM 7f:9m Fisher Exact Test framework 1.00 Success
Sgo2atm1a(EUCOMM)Wtsi WTSI Ophthalmoscope / Left Retina Pigmentation HOM 3f:0m - 1.00 FAILED - Not enough mutant or control data
Sgo2atm1a(EUCOMM)Wtsi WTSI Ophthalmoscope / Left Retina Pigmentation HOM 7f:9m Fisher Exact Test framework 1.00 Success
Sgo2atm1a(EUCOMM)Wtsi WTSI Ophthalmoscope / Right Retina HOM 7f:9m Fisher Exact Test framework 1.00 Success
Sgo2atm1a(EUCOMM)Wtsi WTSI Ophthalmoscope / Right Retina HOM 3f:0m - 1.00 FAILED - Not enough mutant or control data
Sgo2atm1a(EUCOMM)Wtsi WTSI Ophthalmoscope / Right Retina HOM 3f:0m - 1.00 FAILED - Not enough mutant or control data
Sgo2atm1a(EUCOMM)Wtsi WTSI Ophthalmoscope / Right Retina HOM 7f:9m Fisher Exact Test framework 1.00 Success
Sgo2atm1a(EUCOMM)Wtsi WTSI Ophthalmoscope / Left Optic Disc HOM 3f:0m - 1.00 FAILED - Not enough mutant or control data
Sgo2atm1a(EUCOMM)Wtsi WTSI Ophthalmoscope / Left Optic Disc HOM 7f:9m Fisher Exact Test framework 1.00 Success
Sgo2atm1a(EUCOMM)Wtsi WTSI Ophthalmoscope / Left Optic Disc HOM 7f:9m Fisher Exact Test framework 1.00 Success
Sgo2atm1a(EUCOMM)Wtsi WTSI Ophthalmoscope / Left Optic Disc HOM 3f:0m - 1.00 FAILED - Not enough mutant or control data
Sgo2atm1a(EUCOMM)Wtsi WTSI Ophthalmoscope / Eye HOM 3f:0m - 1.00 FAILED - Not enough mutant or control data
Sgo2atm1a(EUCOMM)Wtsi WTSI Ophthalmoscope / Eye HOM 7f:9m Fisher Exact Test framework 1.00 Success
Sgo2atm1a(EUCOMM)Wtsi WTSI Ophthalmoscope / Eye HOM 3f:0m - 1.00 FAILED - Not enough mutant or control data
Sgo2atm1a(EUCOMM)Wtsi WTSI Ophthalmoscope / Eye HOM 7f:9m Fisher Exact Test framework 1.00 Success
Sgo2atm1a(EUCOMM)Wtsi WTSI Ophthalmoscope / Left Retina HOM 3f:0m - 1.00 FAILED - Not enough mutant or control data
Sgo2atm1a(EUCOMM)Wtsi WTSI Ophthalmoscope / Left Retina HOM 7f:9m Fisher Exact Test framework 1.00 Success
Sgo2atm1a(EUCOMM)Wtsi WTSI Ophthalmoscope / Left Retina HOM 3f:0m - 1.00 FAILED - Not enough mutant or control data
Sgo2atm1a(EUCOMM)Wtsi WTSI Ophthalmoscope / Left Retina HOM 7f:9m Fisher Exact Test framework 1.00 Success
Sgo2atm1a(EUCOMM)Wtsi WTSI Clinical Chemistry / Creatine kinase HOM 7f:8m Mixed Model framework, linear mixed-effects model, equation withoutWeight 0.670 Success
Sgo2atm1a(EUCOMM)Wtsi WTSI Clinical Chemistry / Creatine kinase HOM 7f:8m Mixed Model framework, linear mixed-effects model, equation withoutWeight 0.670 Success
Sgo2atm1a(EUCOMM)Wtsi WTSI Clinical Chemistry / Creatine kinase HOM 3f:0m Not processed 1.00 FAILED - Not enough mutant or control data
Sgo2atm1a(EUCOMM)Wtsi WTSI Clinical Chemistry / Creatine kinase HOM 3f:0m Not processed 1.00 FAILED - Not enough mutant or control data
Sgo2atm1a(EUCOMM)Wtsi WTSI Clinical Chemistry / Creatine kinase HOM 0f:1m Not processed 1.00 FAILED - Not enough mutant or control data
Sgo2atm1a(EUCOMM)Wtsi WTSI Clinical Chemistry / Creatine kinase HOM 0f:1m Not processed 1.00 FAILED - Not enough mutant or control data
Sgo2atm1a(EUCOMM)Wtsi WTSI Ophthalmoscope / Right Retina Structure HOM 7f:9m Fisher Exact Test framework 1.00 Not tested (No variation) - OK
Sgo2atm1a(EUCOMM)Wtsi WTSI Ophthalmoscope / Right Retina Structure HOM 3f:0m - 1.00 FAILED - Not enough mutant or control data
Sgo2atm1a(EUCOMM)Wtsi WTSI Ophthalmoscope / Right Retina Structure HOM 3f:0m - 1.00 FAILED - Not enough mutant or control data
Sgo2atm1a(EUCOMM)Wtsi WTSI Ophthalmoscope / Right Retina Structure HOM 7f:9m Fisher Exact Test framework 1.00 Not tested (No variation) - OK
Sgo2atm1a(EUCOMM)Wtsi WTSI Ophthalmoscope / Right Retina Pigmentation HOM 3f:0m - 1.00 FAILED - Not enough mutant or control data
Sgo2atm1a(EUCOMM)Wtsi WTSI Ophthalmoscope / Right Retina Pigmentation HOM 7f:9m Fisher Exact Test framework 1.00 Success
Sgo2atm1a(EUCOMM)Wtsi WTSI Ophthalmoscope / Right Retina Pigmentation HOM 7f:9m Fisher Exact Test framework 1.00 Success
Sgo2atm1a(EUCOMM)Wtsi WTSI Ophthalmoscope / Right Retina Pigmentation HOM 3f:0m - 1.00 FAILED - Not enough mutant or control data
Sgo2atm1a(EUCOMM)Wtsi WTSI Clinical Chemistry / Total cholesterol HOM 7f:8m Mixed Model framework, linear mixed-effects model, equation withoutWeight 0.387 Success
Sgo2atm1a(EUCOMM)Wtsi WTSI Clinical Chemistry / Total cholesterol HOM 7f:8m Mixed Model framework, linear mixed-effects model, equation withoutWeight 0.387 Success
Sgo2atm1a(EUCOMM)Wtsi WTSI Clinical Chemistry / Total cholesterol HOM 3f:0m Not processed 1.00 FAILED - Not enough mutant or control data
Sgo2atm1a(EUCOMM)Wtsi WTSI Clinical Chemistry / Total cholesterol HOM 3f:0m Not processed 1.00 FAILED - Not enough mutant or control data
Sgo2atm1a(EUCOMM)Wtsi WTSI Clinical Chemistry / Total cholesterol HOM 0f:1m Not processed 1.00 FAILED - Not enough mutant or control data
Sgo2atm1a(EUCOMM)Wtsi WTSI Clinical Chemistry / Total cholesterol HOM 0f:1m Not processed 1.00 FAILED - Not enough mutant or control data
Sgo2atm1a(EUCOMM)Wtsi WTSI Clinical Chemistry / Alpha-amylase HOM 7f:8m Mixed Model framework, linear mixed-effects model, equation withoutWeight 0.942 Success
Sgo2atm1a(EUCOMM)Wtsi WTSI Clinical Chemistry / Alpha-amylase HOM 7f:8m Mixed Model framework, linear mixed-effects model, equation withoutWeight 0.942 Success
Sgo2atm1a(EUCOMM)Wtsi WTSI Clinical Chemistry / Alpha-amylase HOM 3f:0m Not processed 1.00 FAILED - Not enough mutant or control data
Sgo2atm1a(EUCOMM)Wtsi WTSI Clinical Chemistry / Alpha-amylase HOM 3f:0m Not processed 1.00 FAILED - Not enough mutant or control data
Sgo2atm1a(EUCOMM)Wtsi WTSI Clinical Chemistry / Alpha-amylase HOM 0f:1m Not processed 1.00 FAILED - Not enough mutant or control data
Sgo2atm1a(EUCOMM)Wtsi WTSI Clinical Chemistry / Alpha-amylase HOM 0f:1m Not processed 1.00 FAILED - Not enough mutant or control data
Sgo2atm1a(EUCOMM)Wtsi WTSI Clinical Chemistry / Alkaline phosphatase HOM 7f:8m Mixed Model framework, linear mixed-effects model, equation withoutWeight 0.823 Success
Sgo2atm1a(EUCOMM)Wtsi WTSI Clinical Chemistry / Alkaline phosphatase HOM 7f:8m Mixed Model framework, linear mixed-effects model, equation withoutWeight 0.823 Success
Sgo2atm1a(EUCOMM)Wtsi WTSI Clinical Chemistry / Alkaline phosphatase HOM 3f:0m Not processed 1.00 FAILED - Not enough mutant or control data
Sgo2atm1a(EUCOMM)Wtsi WTSI Clinical Chemistry / Alkaline phosphatase HOM 3f:0m Not processed 1.00 FAILED - Not enough mutant or control data
Sgo2atm1a(EUCOMM)Wtsi WTSI Clinical Chemistry / Alkaline phosphatase HOM 0f:1m Not processed 1.00 FAILED - Not enough mutant or control data
Sgo2atm1a(EUCOMM)Wtsi WTSI Clinical Chemistry / Alkaline phosphatase HOM 0f:1m Not processed 1.00 FAILED - Not enough mutant or control data
Sgo2atm1a(EUCOMM)Wtsi WTSI Clinical Chemistry / Alanine aminotransferase HOM 7f:8m Mixed Model framework, linear mixed-effects model, equation withoutWeight 0.539 Success
Sgo2atm1a(EUCOMM)Wtsi WTSI Clinical Chemistry / Alanine aminotransferase HOM 7f:8m Mixed Model framework, linear mixed-effects model, equation withoutWeight 0.539 Success
Sgo2atm1a(EUCOMM)Wtsi WTSI Clinical Chemistry / Alanine aminotransferase HOM 3f:0m Not processed 1.00 FAILED - Not enough mutant or control data
Sgo2atm1a(EUCOMM)Wtsi WTSI Clinical Chemistry / Alanine aminotransferase HOM 3f:0m Not processed 1.00 FAILED - Not enough mutant or control data
Sgo2atm1a(EUCOMM)Wtsi WTSI Clinical Chemistry / Alanine aminotransferase HOM 0f:1m Not processed 1.00 FAILED - Not enough mutant or control data
Sgo2atm1a(EUCOMM)Wtsi WTSI Clinical Chemistry / Alanine aminotransferase HOM 0f:1m Not processed 1.00 FAILED - Not enough mutant or control data
Sgo2atm1a(EUCOMM)Wtsi WTSI Clinical Chemistry / Aspartate aminotransferase HOM 7f:8m Mixed Model framework, linear mixed-effects model, equation withoutWeight 0.455 Success
Sgo2atm1a(EUCOMM)Wtsi WTSI Clinical Chemistry / Aspartate aminotransferase HOM 7f:8m Mixed Model framework, linear mixed-effects model, equation withoutWeight 0.455 Success
Sgo2atm1a(EUCOMM)Wtsi WTSI Clinical Chemistry / Aspartate aminotransferase HOM 3f:0m Not processed 1.00 FAILED - Not enough mutant or control data
Sgo2atm1a(EUCOMM)Wtsi WTSI Clinical Chemistry / Aspartate aminotransferase HOM 3f:0m Not processed 1.00 FAILED - Not enough mutant or control data
Sgo2atm1a(EUCOMM)Wtsi WTSI Clinical Chemistry / Aspartate aminotransferase HOM 0f:1m Not processed 1.00 FAILED - Not enough mutant or control data
Sgo2atm1a(EUCOMM)Wtsi WTSI Clinical Chemistry / Aspartate aminotransferase HOM 0f:1m Not processed 1.00 FAILED - Not enough mutant or control data
Sgo2atm1a(EUCOMM)Wtsi WTSI Body Weight / Body Weight HOM 29f:44m Mixed Model framework, linear mixed-effects model, equation withoutWeight 0.0689 Success
Sgo2atm1a(EUCOMM)Wtsi WTSI Body Weight / Body Weight HOM 29f:44m Mixed Model framework, linear mixed-effects model, equation withoutWeight 0.0689 Success
Sgo2atm1a(EUCOMM)Wtsi WTSI Body Weight / Body Weight HOM 12f:0m Mixed Model framework, linear mixed-effects model, equation withoutWeight 0.914 Success
Sgo2atm1a(EUCOMM)Wtsi WTSI Body Weight / Body Weight HOM 12f:0m Mixed Model framework, linear mixed-effects model, equation withoutWeight 0.914 Success
Sgo2atm1a(EUCOMM)Wtsi WTSI Clinical Chemistry / Lactate dehydrogenase HOM 3f:0m Not processed 1.00 FAILED - Not enough mutant or control data
Sgo2atm1a(EUCOMM)Wtsi WTSI Clinical Chemistry / Lactate dehydrogenase HOM 3f:0m Not processed 1.00 FAILED - Not enough mutant or control data
Sgo2atm1a(EUCOMM)Wtsi WTSI Clinical Chemistry / Lactate dehydrogenase HOM 0f:3m Not processed 1.00 FAILED - Not enough mutant measurements (0f/3m)
Sgo2atm1a(EUCOMM)Wtsi WTSI Clinical Chemistry / Lactate dehydrogenase HOM 0f:1m Not processed 1.00 FAILED - Not enough mutant or control data
Sgo2atm1a(EUCOMM)Wtsi WTSI Clinical Chemistry / Lactate dehydrogenase HOM 0f:1m Not processed 1.00 FAILED - Not enough mutant or control data
Sgo2atm1a(EUCOMM)Wtsi WTSI Clinical Chemistry / Lactate dehydrogenase HOM 0f:3m Not processed 1.00 FAILED - Not enough mutant measurements (0f/3m)
Sgo2atm1a(EUCOMM)Wtsi WTSI Clinical Chemistry / Iron HOM 7f:8m Mixed Model framework, linear mixed-effects model, equation withoutWeight 0.0405 Success
Sgo2atm1a(EUCOMM)Wtsi WTSI Clinical Chemistry / Iron HOM 7f:8m Mixed Model framework, linear mixed-effects model, equation withoutWeight 0.0405 Success
Sgo2atm1a(EUCOMM)Wtsi WTSI Clinical Chemistry / Iron HOM 3f:0m Not processed 1.00 FAILED - Not enough mutant or control data
Sgo2atm1a(EUCOMM)Wtsi WTSI Clinical Chemistry / Iron HOM 3f:0m Not processed 1.00 FAILED - Not enough mutant or control data
Sgo2atm1a(EUCOMM)Wtsi WTSI Clinical Chemistry / Iron HOM 0f:1m Not processed 1.00 FAILED - Not enough mutant or control data
Sgo2atm1a(EUCOMM)Wtsi WTSI Clinical Chemistry / Iron HOM 0f:1m Not processed 1.00 FAILED - Not enough mutant or control data
Sgo2atm1a(EUCOMM)Wtsi WTSI Buffy coat peripheral blood leukocyte immunophenotyping / T cell CD3+ percentage HOM 7f:9m Mixed Model framework, linear mixed-effects model, equation withoutWeight 0.0986 Success
Sgo2atm1a(EUCOMM)Wtsi WTSI Clinical Chemistry / Phosphorus HOM 7f:8m Mixed Model framework, linear mixed-effects model, equation withoutWeight 0.998 Success
Sgo2atm1a(EUCOMM)Wtsi WTSI Clinical Chemistry / Phosphorus HOM 7f:8m Mixed Model framework, linear mixed-effects model, equation withoutWeight 0.998 Success
Sgo2atm1a(EUCOMM)Wtsi WTSI Clinical Chemistry / Phosphorus HOM 3f:0m Not processed 1.00 FAILED - Not enough mutant or control data
Sgo2atm1a(EUCOMM)Wtsi WTSI Clinical Chemistry / Phosphorus HOM 3f:0m Not processed 1.00 FAILED - Not enough mutant or control data
Sgo2atm1a(EUCOMM)Wtsi WTSI Clinical Chemistry / Phosphorus HOM 0f:1m Not processed 1.00 FAILED - Not enough mutant or control data
Sgo2atm1a(EUCOMM)Wtsi WTSI Clinical Chemistry / Phosphorus HOM 0f:1m Not processed 1.00 FAILED - Not enough mutant or control data
Sgo2atm1a(EUCOMM)Wtsi WTSI Ophthalmoscope / Right Optic Disc HOM 3f:0m - 1.00 FAILED - Not enough mutant or control data
Sgo2atm1a(EUCOMM)Wtsi WTSI Ophthalmoscope / Right Optic Disc HOM 7f:9m Fisher Exact Test framework 1.00 Not tested (No variation) - OK
Sgo2atm1a(EUCOMM)Wtsi WTSI Ophthalmoscope / Right Optic Disc HOM 7f:9m Fisher Exact Test framework 1.00 Not tested (No variation) - OK
Sgo2atm1a(EUCOMM)Wtsi WTSI Ophthalmoscope / Right Optic Disc HOM 3f:0m - 1.00 FAILED - Not enough mutant or control data
Sgo2atm1a(EUCOMM)Wtsi WTSI Clinical Chemistry / Free fatty acid HOM 7f:8m Mixed Model framework, linear mixed-effects model, equation withoutWeight 0.0124 Success
Sgo2atm1a(EUCOMM)Wtsi WTSI Clinical Chemistry / Free fatty acid HOM 7f:8m Mixed Model framework, linear mixed-effects model, equation withoutWeight 0.0124 Success
Sgo2atm1a(EUCOMM)Wtsi WTSI Clinical Chemistry / Free fatty acid HOM 3f:0m Not processed 1.00 FAILED - Not enough mutant or control data
Sgo2atm1a(EUCOMM)Wtsi WTSI Clinical Chemistry / Free fatty acid HOM 3f:0m Not processed 1.00 FAILED - Not enough mutant or control data
Sgo2atm1a(EUCOMM)Wtsi WTSI Clinical Chemistry / Free fatty acid HOM 0f:1m Not processed 1.00 FAILED - Not enough mutant or control data
Sgo2atm1a(EUCOMM)Wtsi WTSI Clinical Chemistry / Free fatty acid HOM 0f:1m Not processed 1.00 FAILED - Not enough mutant or control data
Sgo2atm1a(EUCOMM)Wtsi WTSI Clinical Chemistry / Triglyceride HOM 7f:8m Mixed Model framework, linear mixed-effects model, equation withoutWeight 0.0318 Success
Sgo2atm1a(EUCOMM)Wtsi WTSI Clinical Chemistry / Triglyceride HOM 7f:8m Mixed Model framework, linear mixed-effects model, equation withoutWeight 0.0318 Success
Sgo2atm1a(EUCOMM)Wtsi WTSI Clinical Chemistry / Triglyceride HOM 3f:0m Not processed 1.00 FAILED - Not enough mutant or control data
Sgo2atm1a(EUCOMM)Wtsi WTSI Clinical Chemistry / Triglyceride HOM 3f:0m Not processed 1.00 FAILED - Not enough mutant or control data
Sgo2atm1a(EUCOMM)Wtsi WTSI Clinical Chemistry / Triglyceride HOM 0f:1m Not processed 1.00 FAILED - Not enough mutant or control data
Sgo2atm1a(EUCOMM)Wtsi WTSI Clinical Chemistry / Triglyceride HOM 0f:1m Not processed 1.00 FAILED - Not enough mutant or control data
Sgo2atm1a(EUCOMM)Wtsi WTSI Ophthalmoscope / Right Eye Blood Vessels Pattern HOM 3f:0m - 1.00 FAILED - Not enough mutant or control data
Sgo2atm1a(EUCOMM)Wtsi WTSI Ophthalmoscope / Right Eye Blood Vessels Pattern HOM 7f:9m Fisher Exact Test framework 1.00 Not tested (No variation) - OK
Sgo2atm1a(EUCOMM)Wtsi WTSI Ophthalmoscope / Right Eye Blood Vessels Pattern HOM 7f:9m Fisher Exact Test framework 1.00 Not tested (No variation) - OK
Sgo2atm1a(EUCOMM)Wtsi WTSI Ophthalmoscope / Right Eye Blood Vessels Pattern HOM 3f:0m - 1.00 FAILED - Not enough mutant or control data
Sgo2atm1a(EUCOMM)Wtsi WTSI Ophthalmoscope / Right Eye Blood Vessels Structure HOM 7f:9m Fisher Exact Test framework 1.00 Not tested (No variation) - OK
Sgo2atm1a(EUCOMM)Wtsi WTSI Ophthalmoscope / Right Eye Blood Vessels Structure HOM 3f:0m - 1.00 FAILED - Not enough mutant or control data
Sgo2atm1a(EUCOMM)Wtsi WTSI Ophthalmoscope / Right Eye Blood Vessels Structure HOM 3f:0m - 1.00 FAILED - Not enough mutant or control data
Sgo2atm1a(EUCOMM)Wtsi WTSI Ophthalmoscope / Right Eye Blood Vessels Structure HOM 7f:9m Fisher Exact Test framework 1.00 Not tested (No variation) - OK
Sgo2atm1a(EUCOMM)Wtsi WTSI Ophthalmoscope / Body Weight HOM 7f:9m Mixed Model framework, linear mixed-effects model, equation withoutWeight 0.0298 Success
Sgo2atm1a(EUCOMM)Wtsi WTSI Ophthalmoscope / Body Weight HOM 7f:9m Mixed Model framework, linear mixed-effects model, equation withoutWeight 0.0298 Success
Sgo2atm1a(EUCOMM)Wtsi WTSI Ophthalmoscope / Body Weight HOM 3f:0m Not processed 1.00 FAILED - Not enough mutant or control data
Sgo2atm1a(EUCOMM)Wtsi WTSI Ophthalmoscope / Body Weight HOM 3f:0m Not processed 1.00 FAILED - Not enough mutant or control data
Sgo2atm1a(EUCOMM)Wtsi WTSI Ophthalmoscope / Left Eye Blood Vessels Structure HOM 7f:9m Fisher Exact Test framework 1.00 Not tested (No variation) - OK
Sgo2atm1a(EUCOMM)Wtsi WTSI Ophthalmoscope / Left Eye Blood Vessels Structure HOM 3f:0m - 1.00 FAILED - Not enough mutant or control data
Sgo2atm1a(EUCOMM)Wtsi WTSI Ophthalmoscope / Left Eye Blood Vessels Structure HOM 3f:0m - 1.00 FAILED - Not enough mutant or control data
Sgo2atm1a(EUCOMM)Wtsi WTSI Ophthalmoscope / Left Eye Blood Vessels Structure HOM 7f:9m Fisher Exact Test framework 1.00 Not tested (No variation) - OK
Sgo2atm1a(EUCOMM)Wtsi WTSI Ophthalmoscope / Left Eye Blood Vessels HOM 3f:0m - 1.00 FAILED - Not enough mutant or control data
Sgo2atm1a(EUCOMM)Wtsi WTSI Ophthalmoscope / Left Eye Blood Vessels HOM 7f:9m Fisher Exact Test framework 1.00 Not tested (No variation) - OK
Sgo2atm1a(EUCOMM)Wtsi WTSI Ophthalmoscope / Left Eye Blood Vessels HOM 3f:0m - 1.00 FAILED - Not enough mutant or control data
Sgo2atm1a(EUCOMM)Wtsi WTSI Ophthalmoscope / Left Eye Blood Vessels HOM 7f:9m Fisher Exact Test framework 1.00 Not tested (No variation) - OK
Sgo2atm1a(EUCOMM)Wtsi WTSI Ophthalmoscope / Right Eye Blood Vessels HOM 3f:0m - 1.00 FAILED - Not enough mutant or control data
Sgo2atm1a(EUCOMM)Wtsi WTSI Ophthalmoscope / Right Eye Blood Vessels HOM 7f:9m Fisher Exact Test framework 1.00 Not tested (No variation) - OK
Sgo2atm1a(EUCOMM)Wtsi WTSI Ophthalmoscope / Right Eye Blood Vessels HOM 7f:9m Fisher Exact Test framework 1.00 Not tested (No variation) - OK
Sgo2atm1a(EUCOMM)Wtsi WTSI Ophthalmoscope / Right Eye Blood Vessels HOM 3f:0m - 1.00 FAILED - Not enough mutant or control data
Sgo2atm1a(EUCOMM)Wtsi WTSI Ophthalmoscope / Left Eye Blood Vessels Pattern HOM 7f:9m Fisher Exact Test framework 1.00 Not tested (No variation) - OK
Sgo2atm1a(EUCOMM)Wtsi WTSI Ophthalmoscope / Left Eye Blood Vessels Pattern HOM 3f:0m - 1.00 FAILED - Not enough mutant or control data
Sgo2atm1a(EUCOMM)Wtsi WTSI Ophthalmoscope / Left Eye Blood Vessels Pattern HOM 3f:0m - 1.00 FAILED - Not enough mutant or control data
Sgo2atm1a(EUCOMM)Wtsi WTSI Ophthalmoscope / Left Eye Blood Vessels Pattern HOM 7f:9m Fisher Exact Test framework 1.00 Not tested (No variation) - OK
Sgo2atm1a(EUCOMM)Wtsi WTSI Clinical Chemistry / Magnesium HOM 7f:8m Mixed Model framework, linear mixed-effects model, equation withoutWeight 0.0573 Success
Sgo2atm1a(EUCOMM)Wtsi WTSI Clinical Chemistry / Magnesium HOM 7f:8m Mixed Model framework, linear mixed-effects model, equation withoutWeight 0.0573 Success
Sgo2atm1a(EUCOMM)Wtsi WTSI Clinical Chemistry / Magnesium HOM 3f:0m Not processed 1.00 FAILED - Not enough mutant or control data
Sgo2atm1a(EUCOMM)Wtsi WTSI Clinical Chemistry / Magnesium HOM 3f:0m Not processed 1.00 FAILED - Not enough mutant or control data
Sgo2atm1a(EUCOMM)Wtsi WTSI Clinical Chemistry / Magnesium HOM 0f:1m Not processed 1.00 FAILED - Not enough mutant or control data
Sgo2atm1a(EUCOMM)Wtsi WTSI Clinical Chemistry / Magnesium HOM 0f:1m Not processed 1.00 FAILED - Not enough mutant or control data
Sgo2atm1a(EUCOMM)Wtsi WTSI Fertility of Homozygous Knock-out Mice / Gross Findings Male HOM f:m Supplied as data Success
Sgo2atm1a(EUCOMM)Wtsi WTSI Clinical Chemistry / Fructosamine HOM 7f:8m Mixed Model framework, linear mixed-effects model, equation withoutWeight 0.898 Success
Sgo2atm1a(EUCOMM)Wtsi WTSI Clinical Chemistry / Fructosamine HOM 7f:8m Mixed Model framework, linear mixed-effects model, equation withoutWeight 0.898 Success
Sgo2atm1a(EUCOMM)Wtsi WTSI Clinical Chemistry / Fructosamine HOM 3f:0m Not processed 1.00 FAILED - Not enough mutant or control data
Sgo2atm1a(EUCOMM)Wtsi WTSI Clinical Chemistry / Fructosamine HOM 3f:0m Not processed 1.00 FAILED - Not enough mutant or control data
Sgo2atm1a(EUCOMM)Wtsi WTSI Clinical Chemistry / Fructosamine HOM 0f:1m Not processed 1.00 FAILED - Not enough mutant or control data
Sgo2atm1a(EUCOMM)Wtsi WTSI Clinical Chemistry / Fructosamine HOM 0f:1m Not processed 1.00 FAILED - Not enough mutant or control data
Sgo2atm1a(EUCOMM)Wtsi WTSI Clinical Chemistry / C-Reactive protein HOM 3f:0m Not processed 1.00 FAILED - Not enough mutant or control data
Sgo2atm1a(EUCOMM)Wtsi WTSI Clinical Chemistry / C-Reactive protein HOM 3f:0m Not processed 1.00 FAILED - Not enough mutant or control data
Sgo2atm1a(EUCOMM)Wtsi WTSI Clinical Chemistry / C-Reactive protein HOM 0f:1m Not processed 1.00 FAILED - Not enough mutant or control data
Sgo2atm1a(EUCOMM)Wtsi WTSI Clinical Chemistry / C-Reactive protein HOM 0f:1m Not processed 1.00 FAILED - Not enough mutant or control data
Sgo2atm1a(EUCOMM)Wtsi WTSI Clinical Chemistry / Transferrin HOM 3f:0m Not processed 1.00 FAILED - Not enough mutant or control data
Sgo2atm1a(EUCOMM)Wtsi WTSI Clinical Chemistry / Transferrin HOM 3f:0m Not processed 1.00 FAILED - Not enough mutant or control data
Sgo2atm1a(EUCOMM)Wtsi WTSI Clinical Chemistry / Transferrin HOM 0f:1m Not processed 1.00 FAILED - Not enough mutant or control data
Sgo2atm1a(EUCOMM)Wtsi WTSI Clinical Chemistry / Transferrin HOM 0f:1m Not processed 1.00 FAILED - Not enough mutant or control data
Sgo2atm1a(EUCOMM)Wtsi WTSI Clinical Chemistry / Ferretin HOM 3f:0m Not processed 1.00 FAILED - Not enough mutant or control data
Sgo2atm1a(EUCOMM)Wtsi WTSI Clinical Chemistry / Ferretin HOM 3f:0m Not processed 1.00 FAILED - Not enough mutant or control data
Sgo2atm1a(EUCOMM)Wtsi WTSI Clinical Chemistry / Ferretin HOM 0f:1m Not processed 1.00 FAILED - Not enough mutant or control data
Sgo2atm1a(EUCOMM)Wtsi WTSI Clinical Chemistry / Ferretin HOM 0f:1m Not processed 1.00 FAILED - Not enough mutant or control data
Sgo2atm1a(EUCOMM)Wtsi WTSI Clinical Chemistry / LDL-cholesterol HOM 7f:8m Mixed Model framework, linear mixed-effects model, equation withoutWeight 0.210 Success
Sgo2atm1a(EUCOMM)Wtsi WTSI Clinical Chemistry / LDL-cholesterol HOM 7f:8m Mixed Model framework, linear mixed-effects model, equation withoutWeight 0.210 Success
Sgo2atm1a(EUCOMM)Wtsi WTSI Clinical Chemistry / LDL-cholesterol HOM 3f:0m Not processed 1.00 FAILED - Not enough mutant or control data
Sgo2atm1a(EUCOMM)Wtsi WTSI Clinical Chemistry / LDL-cholesterol HOM 3f:0m Not processed 1.00 FAILED - Not enough mutant or control data
Sgo2atm1a(EUCOMM)Wtsi WTSI Clinical Chemistry / LDL-cholesterol HOM 0f:1m Not processed 1.00 FAILED - Not enough mutant or control data
Sgo2atm1a(EUCOMM)Wtsi WTSI Clinical Chemistry / LDL-cholesterol HOM 0f:1m Not processed 1.00 FAILED - Not enough mutant or control data
Sgo2atm1a(EUCOMM)Wtsi WTSI Clinical Chemistry / HDL-cholesterol HOM 7f:8m Mixed Model framework, linear mixed-effects model, equation withoutWeight 0.897 Success
Sgo2atm1a(EUCOMM)Wtsi WTSI Clinical Chemistry / HDL-cholesterol HOM 7f:8m Mixed Model framework, linear mixed-effects model, equation withoutWeight 0.897 Success
Sgo2atm1a(EUCOMM)Wtsi WTSI Clinical Chemistry / HDL-cholesterol HOM 3f:0m Not processed 1.00 FAILED - Not enough mutant or control data
Sgo2atm1a(EUCOMM)Wtsi WTSI Clinical Chemistry / HDL-cholesterol HOM 3f:0m Not processed 1.00 FAILED - Not enough mutant or control data
Sgo2atm1a(EUCOMM)Wtsi WTSI Clinical Chemistry / HDL-cholesterol HOM 0f:1m Not processed 1.00 FAILED - Not enough mutant or control data
Sgo2atm1a(EUCOMM)Wtsi WTSI Clinical Chemistry / HDL-cholesterol HOM 0f:1m Not processed 1.00 FAILED - Not enough mutant or control data
Sgo2atm1a(EUCOMM)Wtsi WTSI Clinical Chemistry / Total bilirubin HOM 7f:8m Mixed Model framework, linear mixed-effects model, equation withoutWeight 0.909 Success
Sgo2atm1a(EUCOMM)Wtsi WTSI Clinical Chemistry / Total bilirubin HOM 7f:8m Mixed Model framework, linear mixed-effects model, equation withoutWeight 0.909 Success
Sgo2atm1a(EUCOMM)Wtsi WTSI Clinical Chemistry / Total bilirubin HOM 3f:0m Not processed 1.00 FAILED - Not enough mutant or control data
Sgo2atm1a(EUCOMM)Wtsi WTSI Clinical Chemistry / Total bilirubin HOM 3f:0m Not processed 1.00 FAILED - Not enough mutant or control data
Sgo2atm1a(EUCOMM)Wtsi WTSI Clinical Chemistry / Total bilirubin HOM 0f:1m Not processed 1.00 FAILED - Not enough mutant or control data
Sgo2atm1a(EUCOMM)Wtsi WTSI Clinical Chemistry / Total bilirubin HOM 0f:1m Not processed 1.00 FAILED - Not enough mutant or control data
Sgo2atm1a(EUCOMM)Wtsi WTSI Clinical Chemistry / Uric acid HOM 3f:0m Not processed 1.00 FAILED - Not enough mutant or control data
Sgo2atm1a(EUCOMM)Wtsi WTSI Clinical Chemistry / Uric acid HOM 3f:0m Not processed 1.00 FAILED - Not enough mutant or control data
Sgo2atm1a(EUCOMM)Wtsi WTSI Clinical Chemistry / Uric acid HOM 0f:3m Not processed 1.00 FAILED - Not enough mutant measurements (0f/3m)
Sgo2atm1a(EUCOMM)Wtsi WTSI Clinical Chemistry / Uric acid HOM 0f:1m Not processed 1.00 FAILED - Not enough mutant or control data
Sgo2atm1a(EUCOMM)Wtsi WTSI Clinical Chemistry / Uric acid HOM 0f:3m Not processed 1.00 FAILED - Not enough mutant measurements (0f/3m)
Sgo2atm1a(EUCOMM)Wtsi WTSI Clinical Chemistry / Uric acid HOM 0f:1m Not processed 1.00 FAILED - Not enough mutant or control data
Sgo2atm1a(EUCOMM)Wtsi WTSI Grip Strength / Body weight HOM 7f:9m Mixed Model framework, linear mixed-effects model, equation withoutWeight 0.165 Success
Sgo2atm1a(EUCOMM)Wtsi WTSI Grip Strength / Body weight HOM 7f:9m Mixed Model framework, linear mixed-effects model, equation withoutWeight 0.165 Success
Sgo2atm1a(EUCOMM)Wtsi WTSI Grip Strength / Body weight HOM 3f:0m Not processed 1.00 FAILED - Not enough mutant or control data
Sgo2atm1a(EUCOMM)Wtsi WTSI Grip Strength / Body weight HOM 3f:0m Not processed 1.00 FAILED - Not enough mutant or control data
Sgo2atm1a(EUCOMM)Wtsi WTSI Clinical Chemistry / Glycerol HOM 7f:8m Mixed Model framework, linear mixed-effects model, equation withoutWeight 0.00100 Success
Sgo2atm1a(EUCOMM)Wtsi WTSI Clinical Chemistry / Glycerol HOM 7f:8m Mixed Model framework, linear mixed-effects model, equation withoutWeight 0.00100 Success
Sgo2atm1a(EUCOMM)Wtsi WTSI Clinical Chemistry / Glycerol HOM 3f:0m Not processed 1.00 FAILED - Not enough mutant or control data
Sgo2atm1a(EUCOMM)Wtsi WTSI Clinical Chemistry / Glycerol HOM 3f:0m Not processed 1.00 FAILED - Not enough mutant or control data
Sgo2atm1a(EUCOMM)Wtsi WTSI Clinical Chemistry / Glycerol HOM 0f:1m Not processed 1.00 FAILED - Not enough mutant or control data
Sgo2atm1a(EUCOMM)Wtsi WTSI Clinical Chemistry / Glycerol HOM 0f:1m Not processed 1.00 FAILED - Not enough mutant or control data
Sgo2atm1a(EUCOMM)Wtsi WTSI Hot Plate / Time of first response HOM 7f:9m Mixed Model framework, linear mixed-effects model, equation withoutWeight 0.292 Success
Sgo2atm1a(EUCOMM)Wtsi WTSI Hot Plate / Time of first response HOM 7f:9m Mixed Model framework, linear mixed-effects model, equation withoutWeight 0.292 Success
Sgo2atm1a(EUCOMM)Wtsi WTSI Hot Plate / Time of first response HOM 3f:0m Not processed 1.00 FAILED - Not enough mutant or control data
Sgo2atm1a(EUCOMM)Wtsi WTSI Hot Plate / Time of first response HOM 3f:0m Not processed 1.00 FAILED - Not enough mutant or control data
Sgo2atm1a(EUCOMM)Wtsi WTSI Hot Plate / Body Weight HOM 7f:9m Mixed Model framework, linear mixed-effects model, equation withoutWeight 0.0906 Success
Sgo2atm1a(EUCOMM)Wtsi WTSI Hot Plate / Body Weight HOM 7f:9m Mixed Model framework, linear mixed-effects model, equation withoutWeight 0.0906 Success
Sgo2atm1a(EUCOMM)Wtsi WTSI Hot Plate / Body Weight HOM 3f:0m Not processed 1.00 FAILED - Not enough mutant or control data
Sgo2atm1a(EUCOMM)Wtsi WTSI Hot Plate / Body Weight HOM 3f:0m Not processed 1.00 FAILED - Not enough mutant or control data
Sgo2atm1a(EUCOMM)Wtsi WTSI Dysmorphology / Eye colouration HOM 7f:9m Fisher Exact Test framework 1.00 Success
Sgo2atm1a(EUCOMM)Wtsi WTSI Dysmorphology / Eye colouration HOM 7f:9m Fisher Exact Test framework 1.00 Success
Sgo2atm1a(EUCOMM)Wtsi WTSI Dysmorphology / Eye colouration HOM 3f:0m - 1.00 FAILED - Not enough mutant or control data
Sgo2atm1a(EUCOMM)Wtsi WTSI Dysmorphology / Eye colouration HOM 3f:0m - 1.00 FAILED - Not enough mutant or control data
Sgo2atm1a(EUCOMM)Wtsi WTSI Buffy coat peripheral blood leukocyte immunophenotyping / NKT cell percentage HOM 7f:9m Mixed Model framework, linear mixed-effects model, equation withoutWeight 0.828 Success
Sgo2atm1a(EUCOMM)Wtsi WTSI Dysmorphology / Eye size HOM 3f:0m - 1.00 FAILED - Not enough mutant or control data
Sgo2atm1a(EUCOMM)Wtsi WTSI Dysmorphology / Eye size HOM 3f:0m - 1.00 FAILED - Not enough mutant or control data
Sgo2atm1a(EUCOMM)Wtsi WTSI Dysmorphology / Eye size HOM 7f:9m Fisher Exact Test framework 1.00 Success
Sgo2atm1a(EUCOMM)Wtsi WTSI Dysmorphology / Eye size HOM 7f:9m Fisher Exact Test framework 1.00 Success
Sgo2atm1a(EUCOMM)Wtsi WTSI Dysmorphology / Eyes HOM 7f:9m Fisher Exact Test framework 1.00 Success
Sgo2atm1a(EUCOMM)Wtsi WTSI Dysmorphology / Eyes HOM 3f:0m - 1.00 FAILED - Not enough mutant or control data
Sgo2atm1a(EUCOMM)Wtsi WTSI Dysmorphology / Eyes HOM 3f:0m - 1.00 FAILED - Not enough mutant or control data
Sgo2atm1a(EUCOMM)Wtsi WTSI Dysmorphology / Eyes HOM 7f:9m Fisher Exact Test framework 1.00 Success
Sgo2atm1a(EUCOMM)Wtsi WTSI Indirect Calorimetry / Body mass after experiment HOM 0f:9m Mixed Model framework, linear mixed-effects model, equation withoutWeight 0.395 Success
Sgo2atm1a(EUCOMM)Wtsi WTSI Indirect Calorimetry / Body mass after experiment HOM 0f:9m Mixed Model framework, linear mixed-effects model, equation withoutWeight 0.395 Success
Sgo2atm1a(EUCOMM)Wtsi WTSI Dysmorphology / Incisor HOM 7f:9m Fisher Exact Test framework 1.00 Success
Sgo2atm1a(EUCOMM)Wtsi WTSI Dysmorphology / Incisor HOM 3f:0m - 1.00 FAILED - Not enough mutant or control data
Sgo2atm1a(EUCOMM)Wtsi WTSI Dysmorphology / Incisor HOM 3f:0m - 1.00 FAILED - Not enough mutant or control data
Sgo2atm1a(EUCOMM)Wtsi WTSI Dysmorphology / Incisor HOM 7f:9m Fisher Exact Test framework 1.00 Success
Sgo2atm1a(EUCOMM)Wtsi WTSI Indirect Calorimetry / Body mass before experiment HOM 0f:9m Mixed Model framework, linear mixed-effects model, equation withoutWeight 0.604 Success
Sgo2atm1a(EUCOMM)Wtsi WTSI Indirect Calorimetry / Body mass before experiment HOM 0f:9m Mixed Model framework, linear mixed-effects model, equation withoutWeight 0.604 Success
Sgo2atm1a(EUCOMM)Wtsi WTSI Dysmorphology / Snout morphology HOM 7f:9m Fisher Exact Test framework 1.00 Success
Sgo2atm1a(EUCOMM)Wtsi WTSI Dysmorphology / Snout morphology HOM 3f:0m - 1.00 FAILED - Not enough mutant or control data
Sgo2atm1a(EUCOMM)Wtsi WTSI Dysmorphology / Snout morphology HOM 3f:0m - 1.00 FAILED - Not enough mutant or control data
Sgo2atm1a(EUCOMM)Wtsi WTSI Dysmorphology / Snout morphology HOM 7f:9m Fisher Exact Test framework 1.00 Success
Sgo2atm1a(EUCOMM)Wtsi WTSI Dysmorphology / Mouth morphology HOM 7f:9m Fisher Exact Test framework 1.00 Not tested (No variation) - OK
Sgo2atm1a(EUCOMM)Wtsi WTSI Dysmorphology / Mouth morphology HOM 7f:9m Fisher Exact Test framework 1.00 Not tested (No variation) - OK
Sgo2atm1a(EUCOMM)Wtsi WTSI Dysmorphology / Mouth morphology HOM 3f:0m - 1.00 FAILED - Not enough mutant or control data
Sgo2atm1a(EUCOMM)Wtsi WTSI Dysmorphology / Mouth morphology HOM 3f:0m - 1.00 FAILED - Not enough mutant or control data
Sgo2atm1a(EUCOMM)Wtsi WTSI Dysmorphology / Ear size HOM 7f:9m Fisher Exact Test framework 1.00 Not tested (No variation) - OK
Sgo2atm1a(EUCOMM)Wtsi WTSI Dysmorphology / Ear size HOM 3f:0m - 1.00 FAILED - Not enough mutant or control data
Sgo2atm1a(EUCOMM)Wtsi WTSI Dysmorphology / Ear size HOM 3f:0m - 1.00 FAILED - Not enough mutant or control data
Sgo2atm1a(EUCOMM)Wtsi WTSI Dysmorphology / Ear size HOM 7f:9m Fisher Exact Test framework 1.00 Not tested (No variation) - OK
Sgo2atm1a(EUCOMM)Wtsi WTSI Dysmorphology / Ear morphology HOM 7f:9m Fisher Exact Test framework 1.00 Not tested (No variation) - OK
Sgo2atm1a(EUCOMM)Wtsi WTSI Dysmorphology / Ear morphology HOM 7f:9m Fisher Exact Test framework 1.00 Not tested (No variation) - OK
Sgo2atm1a(EUCOMM)Wtsi WTSI Dysmorphology / Ear morphology HOM 3f:0m - 1.00 FAILED - Not enough mutant or control data
Sgo2atm1a(EUCOMM)Wtsi WTSI Dysmorphology / Ear morphology HOM 3f:0m - 1.00 FAILED - Not enough mutant or control data
Sgo2atm1a(EUCOMM)Wtsi WTSI Dysmorphology / Whiskers HOM 7f:9m Fisher Exact Test framework 1.00 Success
Sgo2atm1a(EUCOMM)Wtsi WTSI Dysmorphology / Whiskers HOM 3f:0m - 1.00 FAILED - Not enough mutant or control data
Sgo2atm1a(EUCOMM)Wtsi WTSI Dysmorphology / Whiskers HOM 3f:0m - 1.00 FAILED - Not enough mutant or control data
Sgo2atm1a(EUCOMM)Wtsi WTSI Dysmorphology / Whiskers HOM 7f:9m Fisher Exact Test framework 1.00 Success
Sgo2atm1a(EUCOMM)Wtsi WTSI Dysmorphology / Incisor colour HOM 3f:0m - 1.00 FAILED - Not enough mutant or control data
Sgo2atm1a(EUCOMM)Wtsi WTSI Dysmorphology / Incisor colour HOM 3f:0m - 1.00 FAILED - Not enough mutant or control data
Sgo2atm1a(EUCOMM)Wtsi WTSI Dysmorphology / Incisor colour HOM 7f:9m Fisher Exact Test framework 1.00 Not tested (No variation) - OK
Sgo2atm1a(EUCOMM)Wtsi WTSI Dysmorphology / Incisor colour HOM 7f:9m Fisher Exact Test framework 1.00 Not tested (No variation) - OK
Sgo2atm1a(EUCOMM)Wtsi WTSI X-ray / Shape of femur HOM 3f:0m - 1.00 FAILED - Not enough mutant or control data
Sgo2atm1a(EUCOMM)Wtsi WTSI X-ray / Shape of femur HOM 3f:0m - 1.00 FAILED - Not enough mutant or control data
Sgo2atm1a(EUCOMM)Wtsi WTSI X-ray / Shape of femur HOM 7f:9m Fisher Exact Test framework 1.00 Success
Sgo2atm1a(EUCOMM)Wtsi WTSI X-ray / Shape of femur HOM 7f:9m Fisher Exact Test framework 1.00 Success
Sgo2atm1a(EUCOMM)Wtsi WTSI X-ray / Number of digits HOM 3f:0m Not processed 1.00 FAILED - Not enough mutant or control data
Sgo2atm1a(EUCOMM)Wtsi WTSI X-ray / Number of digits HOM 3f:0m Not processed 1.00 FAILED - Not enough mutant or control data
Sgo2atm1a(EUCOMM)Wtsi WTSI X-ray / Number of digits HOM 7f:9m Not processed 1.00 FAILED - No variability in dependent variable 'M.G.P_006_001_004'.
Sgo2atm1a(EUCOMM)Wtsi WTSI X-ray / Number of digits HOM 7f:9m Not processed 1.00 FAILED - No variability in dependent variable 'M.G.P_006_001_004'.
Sgo2atm1a(EUCOMM)Wtsi WTSI X-ray / Shape of humerus HOM 3f:0m - 1.00 FAILED - Not enough mutant or control data
Sgo2atm1a(EUCOMM)Wtsi WTSI X-ray / Shape of humerus HOM 3f:0m - 1.00 FAILED - Not enough mutant or control data
Sgo2atm1a(EUCOMM)Wtsi WTSI X-ray / Shape of humerus HOM 7f:9m Fisher Exact Test framework 1.00 Not tested (No variation) - OK
Sgo2atm1a(EUCOMM)Wtsi WTSI X-ray / Shape of humerus HOM 7f:9m Fisher Exact Test framework 1.00 Not tested (No variation) - OK
Sgo2atm1a(EUCOMM)Wtsi WTSI X-ray / Fibula HOM 3f:0m - 1.00 FAILED - Not enough mutant or control data
Sgo2atm1a(EUCOMM)Wtsi WTSI X-ray / Fibula HOM 3f:0m - 1.00 FAILED - Not enough mutant or control data
Sgo2atm1a(EUCOMM)Wtsi WTSI X-ray / Fibula HOM 7f:9m Fisher Exact Test framework 1.00 Not tested (No variation) - OK
Sgo2atm1a(EUCOMM)Wtsi WTSI X-ray / Fibula HOM 7f:9m Fisher Exact Test framework 1.00 Not tested (No variation) - OK
Sgo2atm1a(EUCOMM)Wtsi WTSI X-ray / Mandibles HOM 3f:0m - 1.00 FAILED - Not enough mutant or control data
Sgo2atm1a(EUCOMM)Wtsi WTSI X-ray / Mandibles HOM 3f:0m - 1.00 FAILED - Not enough mutant or control data
Sgo2atm1a(EUCOMM)Wtsi WTSI X-ray / Mandibles HOM 7f:9m Fisher Exact Test framework 1.00 Not tested (No variation) - OK
Sgo2atm1a(EUCOMM)Wtsi WTSI X-ray / Mandibles HOM 7f:9m Fisher Exact Test framework 1.00 Not tested (No variation) - OK
Sgo2atm1a(EUCOMM)Wtsi WTSI Dysmorphology / Genitalia size HOM 7f:9m Fisher Exact Test framework 1.00 Not tested (No variation) - OK
Sgo2atm1a(EUCOMM)Wtsi WTSI Dysmorphology / Genitalia size HOM 3f:0m - 1.00 FAILED - Not enough mutant or control data
Sgo2atm1a(EUCOMM)Wtsi WTSI Dysmorphology / Genitalia size HOM 3f:0m - 1.00 FAILED - Not enough mutant or control data
Sgo2atm1a(EUCOMM)Wtsi WTSI Dysmorphology / Genitalia size HOM 7f:9m Fisher Exact Test framework 1.00 Not tested (No variation) - OK
Sgo2atm1a(EUCOMM)Wtsi WTSI X-ray / Joints HOM 3f:0m - 1.00 FAILED - Not enough mutant or control data
Sgo2atm1a(EUCOMM)Wtsi WTSI X-ray / Joints HOM 3f:0m - 1.00 FAILED - Not enough mutant or control data
Sgo2atm1a(EUCOMM)Wtsi WTSI X-ray / Joints HOM 7f:9m Fisher Exact Test framework 1.00 Success
Sgo2atm1a(EUCOMM)Wtsi WTSI X-ray / Joints HOM 7f:9m Fisher Exact Test framework 1.00 Success
Sgo2atm1a(EUCOMM)Wtsi WTSI Antigen Specific Immunoglobulin Assay / TetC specific IgG1 HOM 3f:0m Not processed 1.00 FAILED - Not enough mutant or control data
Sgo2atm1a(EUCOMM)Wtsi WTSI X-ray / Clavicle HOM 3f:0m - 1.00 FAILED - Not enough mutant or control data
Sgo2atm1a(EUCOMM)Wtsi WTSI X-ray / Clavicle HOM 3f:0m - 1.00 FAILED - Not enough mutant or control data
Sgo2atm1a(EUCOMM)Wtsi WTSI X-ray / Clavicle HOM 7f:9m Fisher Exact Test framework 1.00 Not tested (No variation) - OK
Sgo2atm1a(EUCOMM)Wtsi WTSI X-ray / Clavicle HOM 7f:9m Fisher Exact Test framework 1.00 Not tested (No variation) - OK
Sgo2atm1a(EUCOMM)Wtsi WTSI X-ray / Digit integrity HOM 3f:0m - 1.00 FAILED - Not enough mutant or control data
Sgo2atm1a(EUCOMM)Wtsi WTSI X-ray / Digit integrity HOM 3f:0m - 1.00 FAILED - Not enough mutant or control data
Sgo2atm1a(EUCOMM)Wtsi WTSI X-ray / Digit integrity HOM 7f:9m Fisher Exact Test framework 1.00 Success
Sgo2atm1a(EUCOMM)Wtsi WTSI X-ray / Digit integrity HOM 7f:9m Fisher Exact Test framework 1.00 Success
Sgo2atm1a(EUCOMM)Wtsi WTSI X-ray / Completeness of digits HOM 3f:0m - 1.00 FAILED - Not enough mutant or control data
Sgo2atm1a(EUCOMM)Wtsi WTSI X-ray / Completeness of digits HOM 3f:0m - 1.00 FAILED - Not enough mutant or control data
Sgo2atm1a(EUCOMM)Wtsi WTSI X-ray / Completeness of digits HOM 7f:9m Fisher Exact Test framework 1.00 Not tested (No variation) - OK
Sgo2atm1a(EUCOMM)Wtsi WTSI X-ray / Completeness of digits HOM 7f:9m Fisher Exact Test framework 1.00 Not tested (No variation) - OK
Sgo2atm1a(EUCOMM)Wtsi WTSI Dysmorphology / Genitalia morphology HOM 3f:0m - 1.00 FAILED - Not enough mutant or control data
Sgo2atm1a(EUCOMM)Wtsi WTSI Dysmorphology / Genitalia morphology HOM 7f:9m Fisher Exact Test framework 1.00 Not tested (No variation) - OK
Sgo2atm1a(EUCOMM)Wtsi WTSI Dysmorphology / Genitalia morphology HOM 3f:0m - 1.00 FAILED - Not enough mutant or control data
Sgo2atm1a(EUCOMM)Wtsi WTSI Dysmorphology / Genitalia morphology HOM 7f:9m Fisher Exact Test framework 1.00 Not tested (No variation) - OK
Sgo2atm1a(EUCOMM)Wtsi WTSI Dysmorphology / Genitalia HOM 3f:0m - 1.00 FAILED - Not enough mutant or control data
Sgo2atm1a(EUCOMM)Wtsi WTSI Dysmorphology / Genitalia HOM 3f:0m - 1.00 FAILED - Not enough mutant or control data
Sgo2atm1a(EUCOMM)Wtsi WTSI Dysmorphology / Genitalia HOM 7f:9m Fisher Exact Test framework 1.00 Not tested (No variation) - OK
Sgo2atm1a(EUCOMM)Wtsi WTSI Dysmorphology / Genitalia HOM 7f:9m Fisher Exact Test framework 1.00 Not tested (No variation) - OK
Sgo2atm1a(EUCOMM)Wtsi WTSI Dysmorphology / Forepaw nails HOM 7f:9m Fisher Exact Test framework 1.00 Success
Sgo2atm1a(EUCOMM)Wtsi WTSI Dysmorphology / Forepaw nails HOM 7f:9m Fisher Exact Test framework 1.00 Success
Sgo2atm1a(EUCOMM)Wtsi WTSI Dysmorphology / Forepaw nails HOM 3f:0m - 1.00 FAILED - Not enough mutant or control data
Sgo2atm1a(EUCOMM)Wtsi WTSI Dysmorphology / Forepaw nails HOM 3f:0m - 1.00 FAILED - Not enough mutant or control data
Sgo2atm1a(EUCOMM)Wtsi WTSI Dysmorphology / Forepaw Foot pads HOM 3f:0m - 1.00 FAILED - Not enough mutant or control data
Sgo2atm1a(EUCOMM)Wtsi WTSI Dysmorphology / Forepaw Foot pads HOM 3f:0m - 1.00 FAILED - Not enough mutant or control data
Sgo2atm1a(EUCOMM)Wtsi WTSI Dysmorphology / Forepaw Foot pads HOM 7f:9m Fisher Exact Test framework 1.00 Success
Sgo2atm1a(EUCOMM)Wtsi WTSI Dysmorphology / Forepaw Foot pads HOM 7f:9m Fisher Exact Test framework 1.00 Success
Sgo2atm1a(EUCOMM)Wtsi WTSI Dysmorphology / Forepaw size HOM 7f:9m Fisher Exact Test framework 1.00 Not tested (No variation) - OK
Sgo2atm1a(EUCOMM)Wtsi WTSI Dysmorphology / Forepaw size HOM 7f:9m Fisher Exact Test framework 1.00 Not tested (No variation) - OK
Sgo2atm1a(EUCOMM)Wtsi WTSI Dysmorphology / Forepaw size HOM 3f:0m - 1.00 FAILED - Not enough mutant or control data
Sgo2atm1a(EUCOMM)Wtsi WTSI Dysmorphology / Forepaw size HOM 3f:0m - 1.00 FAILED - Not enough mutant or control data
Sgo2atm1a(EUCOMM)Wtsi WTSI Dysmorphology / Forelimb size HOM 7f:9m Fisher Exact Test framework 1.00 Not tested (No variation) - OK
Sgo2atm1a(EUCOMM)Wtsi WTSI Dysmorphology / Forelimb size HOM 3f:0m - 1.00 FAILED - Not enough mutant or control data
Sgo2atm1a(EUCOMM)Wtsi WTSI Dysmorphology / Forelimb size HOM 3f:0m - 1.00 FAILED - Not enough mutant or control data
Sgo2atm1a(EUCOMM)Wtsi WTSI Dysmorphology / Forelimb size HOM 7f:9m Fisher Exact Test framework 1.00 Not tested (No variation) - OK
Sgo2atm1a(EUCOMM)Wtsi WTSI Dysmorphology / Hindlimb nails HOM 7f:9m Fisher Exact Test framework 0.651 Success
Sgo2atm1a(EUCOMM)Wtsi WTSI Dysmorphology / Hindlimb nails HOM 7f:9m Fisher Exact Test framework 0.651 Success
Sgo2atm1a(EUCOMM)Wtsi WTSI Dysmorphology / Hindlimb nails HOM 3f:0m - 1.00 FAILED - Not enough mutant or control data
Sgo2atm1a(EUCOMM)Wtsi WTSI Dysmorphology / Hindlimb nails HOM 3f:0m - 1.00 FAILED - Not enough mutant or control data
Sgo2atm1a(EUCOMM)Wtsi WTSI Dysmorphology / Hindlimb foot pads HOM 3f:0m - 1.00 FAILED - Not enough mutant or control data
Sgo2atm1a(EUCOMM)Wtsi WTSI Dysmorphology / Hindlimb foot pads HOM 3f:0m - 1.00 FAILED - Not enough mutant or control data
Sgo2atm1a(EUCOMM)Wtsi WTSI Dysmorphology / Hindlimb foot pads HOM 7f:9m Fisher Exact Test framework 1.00 Success
Sgo2atm1a(EUCOMM)Wtsi WTSI Dysmorphology / Hindlimb foot pads HOM 7f:9m Fisher Exact Test framework 1.00 Success
Sgo2atm1a(EUCOMM)Wtsi WTSI Dysmorphology / Hind paw size HOM 7f:9m Fisher Exact Test framework 1.00 Not tested (No variation) - OK
Sgo2atm1a(EUCOMM)Wtsi WTSI Dysmorphology / Hind paw size HOM 3f:0m - 1.00 FAILED - Not enough mutant or control data
Sgo2atm1a(EUCOMM)Wtsi WTSI Dysmorphology / Hind paw size HOM 3f:0m - 1.00 FAILED - Not enough mutant or control data
Sgo2atm1a(EUCOMM)Wtsi WTSI Dysmorphology / Hind paw size HOM 7f:9m Fisher Exact Test framework 1.00 Not tested (No variation) - OK
Sgo2atm1a(EUCOMM)Wtsi WTSI Dysmorphology / Hindlimb size HOM 3f:0m - 1.00 FAILED - Not enough mutant or control data
Sgo2atm1a(EUCOMM)Wtsi WTSI Dysmorphology / Hindlimb size HOM 3f:0m - 1.00 FAILED - Not enough mutant or control data
Sgo2atm1a(EUCOMM)Wtsi WTSI Dysmorphology / Hindlimb size HOM 7f:9m Fisher Exact Test framework 1.00 Not tested (No variation) - OK
Sgo2atm1a(EUCOMM)Wtsi WTSI Dysmorphology / Hindlimb size HOM 7f:9m Fisher Exact Test framework 1.00 Not tested (No variation) - OK
Sgo2atm1a(EUCOMM)Wtsi WTSI X-ray / Number of ribs right HOM 3f:0m Not processed 1.00 FAILED - Not enough mutant or control data
Sgo2atm1a(EUCOMM)Wtsi WTSI X-ray / Number of ribs right HOM 3f:0m Not processed 1.00 FAILED - Not enough mutant or control data
Sgo2atm1a(EUCOMM)Wtsi WTSI X-ray / Number of ribs right HOM 7f:9m Not processed 1.00 FAILED - No variability in dependent variable 'M.G.P_006_001_016'.
Sgo2atm1a(EUCOMM)Wtsi WTSI X-ray / Number of ribs right HOM 7f:9m Not processed 1.00 FAILED - No variability in dependent variable 'M.G.P_006_001_016'.
Sgo2atm1a(EUCOMM)Wtsi WTSI X-ray / Number of ribs left HOM 3f:0m Not processed 1.00 FAILED - Not enough mutant or control data
Sgo2atm1a(EUCOMM)Wtsi WTSI X-ray / Number of ribs left HOM 3f:0m Not processed 1.00 FAILED - Not enough mutant or control data
Sgo2atm1a(EUCOMM)Wtsi WTSI X-ray / Number of ribs left HOM 7f:9m Not processed 1.00 FAILED - No variability in dependent variable 'M.G.P_006_001_015'.
Sgo2atm1a(EUCOMM)Wtsi WTSI X-ray / Number of ribs left HOM 7f:9m Not processed 1.00 FAILED - No variability in dependent variable 'M.G.P_006_001_015'.
Sgo2atm1a(EUCOMM)Wtsi WTSI X-ray / Scapulae HOM 3f:0m - 1.00 FAILED - Not enough mutant or control data
Sgo2atm1a(EUCOMM)Wtsi WTSI X-ray / Scapulae HOM 3f:0m - 1.00 FAILED - Not enough mutant or control data
Sgo2atm1a(EUCOMM)Wtsi WTSI X-ray / Scapulae HOM 7f:9m Fisher Exact Test framework 1.00 Not tested (No variation) - OK
Sgo2atm1a(EUCOMM)Wtsi WTSI X-ray / Scapulae HOM 7f:9m Fisher Exact Test framework 1.00 Not tested (No variation) - OK
Sgo2atm1a(EUCOMM)Wtsi WTSI X-ray / Shape of ribs HOM 3f:0m - 1.00 FAILED - Not enough mutant or control data
Sgo2atm1a(EUCOMM)Wtsi WTSI X-ray / Shape of ribs HOM 3f:0m - 1.00 FAILED - Not enough mutant or control data
Sgo2atm1a(EUCOMM)Wtsi WTSI X-ray / Shape of ribs HOM 7f:9m Fisher Exact Test framework 1.00 Not tested (No variation) - OK
Sgo2atm1a(EUCOMM)Wtsi WTSI X-ray / Shape of ribs HOM 7f:9m Fisher Exact Test framework 1.00 Not tested (No variation) - OK
Sgo2atm1a(EUCOMM)Wtsi WTSI X-ray / Skull shape HOM 3f:0m - 1.00 FAILED - Not enough mutant or control data
Sgo2atm1a(EUCOMM)Wtsi WTSI X-ray / Skull shape HOM 3f:0m - 1.00 FAILED - Not enough mutant or control data
Sgo2atm1a(EUCOMM)Wtsi WTSI X-ray / Skull shape HOM 7f:9m Fisher Exact Test framework 1.00 Success
Sgo2atm1a(EUCOMM)Wtsi WTSI X-ray / Skull shape HOM 7f:9m Fisher Exact Test framework 1.00 Success
Sgo2atm1a(EUCOMM)Wtsi WTSI X-ray / Maxilla HOM 3f:0m - 1.00 FAILED - Not enough mutant or control data
Sgo2atm1a(EUCOMM)Wtsi WTSI X-ray / Maxilla HOM 3f:0m - 1.00 FAILED - Not enough mutant or control data
Sgo2atm1a(EUCOMM)Wtsi WTSI X-ray / Maxilla HOM 7f:9m Fisher Exact Test framework 1.00 Success
Sgo2atm1a(EUCOMM)Wtsi WTSI X-ray / Maxilla HOM 7f:9m Fisher Exact Test framework 1.00 Success
Sgo2atm1a(EUCOMM)Wtsi WTSI X-ray / Pelvis HOM 7f:9m Fisher Exact Test framework 0.374 Success
Sgo2atm1a(EUCOMM)Wtsi WTSI X-ray / Pelvis HOM 7f:9m Fisher Exact Test framework 0.374 Success
Sgo2atm1a(EUCOMM)Wtsi WTSI X-ray / Pelvis HOM 3f:0m - 1.00 FAILED - Not enough mutant or control data
Sgo2atm1a(EUCOMM)Wtsi WTSI X-ray / Pelvis HOM 3f:0m - 1.00 FAILED - Not enough mutant or control data
Sgo2atm1a(EUCOMM)Wtsi WTSI X-ray / Orbit HOM 3f:0m - 1.00 FAILED - Not enough mutant or control data
Sgo2atm1a(EUCOMM)Wtsi WTSI X-ray / Orbit HOM 3f:0m - 1.00 FAILED - Not enough mutant or control data
Sgo2atm1a(EUCOMM)Wtsi WTSI X-ray / Orbit HOM 7f:9m Fisher Exact Test framework 1.00 Success
Sgo2atm1a(EUCOMM)Wtsi WTSI X-ray / Orbit HOM 7f:9m Fisher Exact Test framework 1.00 Success
Sgo2atm1a(EUCOMM)Wtsi WTSI Buffy coat peripheral blood leukocyte immunophenotyping / B cell CD19+ percentage HOM 7f:9m Mixed Model framework, linear mixed-effects model, equation withoutWeight 0.258 Success
Sgo2atm1a(EUCOMM)Wtsi WTSI X-ray / Rib HOM 3f:0m - 1.00 FAILED - Not enough mutant or control data
Sgo2atm1a(EUCOMM)Wtsi WTSI X-ray / Rib HOM 3f:0m - 1.00 FAILED - Not enough mutant or control data
Sgo2atm1a(EUCOMM)Wtsi WTSI X-ray / Rib HOM 7f:9m Fisher Exact Test framework 1.00 Not tested (No variation) - OK
Sgo2atm1a(EUCOMM)Wtsi WTSI X-ray / Rib HOM 7f:9m Fisher Exact Test framework 1.00 Not tested (No variation) - OK
Sgo2atm1a(EUCOMM)Wtsi WTSI X-ray / Radius HOM 3f:0m - 1.00 FAILED - Not enough mutant or control data
Sgo2atm1a(EUCOMM)Wtsi WTSI X-ray / Radius HOM 3f:0m - 1.00 FAILED - Not enough mutant or control data
Sgo2atm1a(EUCOMM)Wtsi WTSI X-ray / Radius HOM 7f:9m Fisher Exact Test framework 1.00 Success
Sgo2atm1a(EUCOMM)Wtsi WTSI X-ray / Radius HOM 7f:9m Fisher Exact Test framework 1.00 Success
Sgo2atm1a(EUCOMM)Wtsi WTSI Buffy coat peripheral blood leukocyte immunophenotyping / Mature B cell IgD+ percentage HOM 7f:9m Mixed Model framework, linear mixed-effects model, equation withoutWeight 0.186 Success
Sgo2atm1a(EUCOMM)Wtsi WTSI Dysmorphology / Tail morphology HOM 3f:0m - 1.00 FAILED - Not enough mutant or control data
Sgo2atm1a(EUCOMM)Wtsi WTSI Dysmorphology / Tail morphology HOM 7f:9m Fisher Exact Test framework 1.00 Not tested (No variation) - OK
Sgo2atm1a(EUCOMM)Wtsi WTSI Dysmorphology / Tail morphology HOM 3f:0m - 1.00 FAILED - Not enough mutant or control data
Sgo2atm1a(EUCOMM)Wtsi WTSI Dysmorphology / Tail morphology HOM 7f:9m Fisher Exact Test framework 1.00 Not tested (No variation) - OK
Sgo2atm1a(EUCOMM)Wtsi WTSI Dysmorphology / Tail length HOM 3f:0m - 1.00 FAILED - Not enough mutant or control data
Sgo2atm1a(EUCOMM)Wtsi WTSI Dysmorphology / Tail length HOM 7f:9m Fisher Exact Test framework 1.00 Not tested (No variation) - OK
Sgo2atm1a(EUCOMM)Wtsi WTSI Dysmorphology / Tail length HOM 3f:0m - 1.00 FAILED - Not enough mutant or control data
Sgo2atm1a(EUCOMM)Wtsi WTSI Dysmorphology / Tail length HOM 7f:9m Fisher Exact Test framework 1.00 Not tested (No variation) - OK
Sgo2atm1a(EUCOMM)Wtsi WTSI X-ray / Number of lumbar vertebrae HOM 3f:0m Not processed 1.00 FAILED - Not enough mutant or control data
Sgo2atm1a(EUCOMM)Wtsi WTSI X-ray / Number of lumbar vertebrae HOM 3f:0m Not processed 1.00 FAILED - Not enough mutant or control data
Sgo2atm1a(EUCOMM)Wtsi WTSI X-ray / Number of lumbar vertebrae HOM 7f:9m Not processed 1.00 FAILED - testDataset returned an error, check log file
Sgo2atm1a(EUCOMM)Wtsi WTSI X-ray / Number of lumbar vertebrae HOM 7f:9m Not processed 1.00 FAILED - testDataset returned an error, check log file
Sgo2atm1a(EUCOMM)Wtsi WTSI X-ray / Fusion of vertebrae HOM 7f:9m Fisher Exact Test framework 0.149 Success
Sgo2atm1a(EUCOMM)Wtsi WTSI X-ray / Fusion of vertebrae HOM 7f:9m Fisher Exact Test framework 0.149 Success
Sgo2atm1a(EUCOMM)Wtsi WTSI X-ray / Fusion of vertebrae HOM 3f:0m - 1.00 FAILED - Not enough mutant or control data
Sgo2atm1a(EUCOMM)Wtsi WTSI X-ray / Fusion of vertebrae HOM 3f:0m - 1.00 FAILED - Not enough mutant or control data
Sgo2atm1a(EUCOMM)Wtsi WTSI X-ray / Processes on vertebrae HOM 7f:9m Fisher Exact Test framework 0.000525 Success
Sgo2atm1a(EUCOMM)Wtsi WTSI X-ray / Processes on vertebrae HOM 7f:9m Fisher Exact Test framework 0.000525 Success
Sgo2atm1a(EUCOMM)Wtsi WTSI X-ray / Processes on vertebrae HOM 3f:0m - 1.00 FAILED - Not enough mutant or control data
Sgo2atm1a(EUCOMM)Wtsi WTSI X-ray / Processes on vertebrae HOM 3f:0m - 1.00 FAILED - Not enough mutant or control data
Sgo2atm1a(EUCOMM)Wtsi WTSI X-ray / Number of pelvic vertebrae HOM 3f:0m Not processed 1.00 FAILED - Not enough mutant or control data
Sgo2atm1a(EUCOMM)Wtsi WTSI X-ray / Number of pelvic vertebrae HOM 3f:0m Not processed 1.00 FAILED - Not enough mutant or control data
Sgo2atm1a(EUCOMM)Wtsi WTSI X-ray / Number of pelvic vertebrae HOM 7f:9m Not processed 1.00 FAILED - testDataset returned an error, check log file
Sgo2atm1a(EUCOMM)Wtsi WTSI X-ray / Number of pelvic vertebrae HOM 7f:9m Not processed 1.00 FAILED - testDataset returned an error, check log file
Sgo2atm1a(EUCOMM)Wtsi WTSI Buffy coat peripheral blood leukocyte immunophenotyping / T cell CD4+ percentage HOM 7f:9m Mixed Model framework, linear mixed-effects model, equation withoutWeight 0.0294 Success
Sgo2atm1a(EUCOMM)Wtsi WTSI X-ray / Teeth HOM 3f:0m - 1.00 FAILED - Not enough mutant or control data
Sgo2atm1a(EUCOMM)Wtsi WTSI X-ray / Teeth HOM 3f:0m - 1.00 FAILED - Not enough mutant or control data
Sgo2atm1a(EUCOMM)Wtsi WTSI X-ray / Teeth HOM 7f:9m Fisher Exact Test framework 1.00 Success
Sgo2atm1a(EUCOMM)Wtsi WTSI X-ray / Teeth HOM 7f:9m Fisher Exact Test framework 1.00 Success
Sgo2atm1a(EUCOMM)Wtsi WTSI X-ray / Syndactylism HOM 3f:0m - 1.00 FAILED - Not enough mutant or control data
Sgo2atm1a(EUCOMM)Wtsi WTSI X-ray / Syndactylism HOM 3f:0m - 1.00 FAILED - Not enough mutant or control data
Sgo2atm1a(EUCOMM)Wtsi WTSI X-ray / Syndactylism HOM 7f:9m Fisher Exact Test framework 1.00 Not tested (No variation) - OK
Sgo2atm1a(EUCOMM)Wtsi WTSI X-ray / Syndactylism HOM 7f:9m Fisher Exact Test framework 1.00 Not tested (No variation) - OK
Sgo2atm1a(EUCOMM)Wtsi WTSI X-ray / Ulna HOM 3f:0m - 1.00 FAILED - Not enough mutant or control data
Sgo2atm1a(EUCOMM)Wtsi WTSI X-ray / Ulna HOM 3f:0m - 1.00 FAILED - Not enough mutant or control data
Sgo2atm1a(EUCOMM)Wtsi WTSI X-ray / Ulna HOM 7f:9m Fisher Exact Test framework 1.00 Success
Sgo2atm1a(EUCOMM)Wtsi WTSI X-ray / Ulna HOM 7f:9m Fisher Exact Test framework 1.00 Success
Sgo2atm1a(EUCOMM)Wtsi WTSI X-ray / Tibia HOM 3f:0m - 1.00 FAILED - Not enough mutant or control data
Sgo2atm1a(EUCOMM)Wtsi WTSI X-ray / Tibia HOM 3f:0m - 1.00 FAILED - Not enough mutant or control data
Sgo2atm1a(EUCOMM)Wtsi WTSI X-ray / Tibia HOM 7f:9m Fisher Exact Test framework 1.00 Not tested (No variation) - OK
Sgo2atm1a(EUCOMM)Wtsi WTSI X-ray / Tibia HOM 7f:9m Fisher Exact Test framework 1.00 Not tested (No variation) - OK
Sgo2atm1a(EUCOMM)Wtsi WTSI X-ray / Number of cervical vertebrae HOM 3f:0m Not processed 1.00 FAILED - Not enough mutant or control data
Sgo2atm1a(EUCOMM)Wtsi WTSI X-ray / Number of cervical vertebrae HOM 3f:0m Not processed 1.00 FAILED - Not enough mutant or control data
Sgo2atm1a(EUCOMM)Wtsi WTSI X-ray / Number of cervical vertebrae HOM 7f:9m Not processed 1.00 FAILED - No variability in dependent variable 'M.G.P_006_001_025'.
Sgo2atm1a(EUCOMM)Wtsi WTSI X-ray / Number of cervical vertebrae HOM 7f:9m Not processed 1.00 FAILED - No variability in dependent variable 'M.G.P_006_001_025'.
Sgo2atm1a(EUCOMM)Wtsi WTSI X-ray / Number of caudal vertebrae HOM 7f:9m Mixed Model framework, linear mixed-effects model, equation withoutWeight 0.00333 Success
Sgo2atm1a(EUCOMM)Wtsi WTSI X-ray / Number of caudal vertebrae HOM 7f:9m Mixed Model framework, linear mixed-effects model, equation withoutWeight 0.00333 Success
Sgo2atm1a(EUCOMM)Wtsi WTSI X-ray / Number of caudal vertebrae HOM 3f:0m Not processed 1.00 FAILED - Not enough mutant or control data
Sgo2atm1a(EUCOMM)Wtsi WTSI X-ray / Number of caudal vertebrae HOM 3f:0m Not processed 1.00 FAILED - Not enough mutant or control data
Sgo2atm1a(EUCOMM)Wtsi WTSI Slit Lamp / cornea vascularisation HOM 7f:9m Fisher Exact Test framework 1.00 Success
Sgo2atm1a(EUCOMM)Wtsi WTSI Slit Lamp / cornea vascularisation HOM 3f:0m - 1.00 FAILED - Not enough mutant or control data
Sgo2atm1a(EUCOMM)Wtsi WTSI Slit Lamp / cornea vascularisation HOM 7f:9m Fisher Exact Test framework 1.00 Success
Sgo2atm1a(EUCOMM)Wtsi WTSI Slit Lamp / cornea vascularisation HOM 3f:0m - 1.00 FAILED - Not enough mutant or control data
Sgo2atm1a(EUCOMM)Wtsi WTSI Slit Lamp / cornea opacity HOM 7f:9m Fisher Exact Test framework 1.00 Success
Sgo2atm1a(EUCOMM)Wtsi WTSI Slit Lamp / cornea opacity HOM 3f:0m - 1.00 FAILED - Not enough mutant or control data
Sgo2atm1a(EUCOMM)Wtsi WTSI Slit Lamp / cornea opacity HOM 7f:9m Fisher Exact Test framework 1.00 Success
Sgo2atm1a(EUCOMM)Wtsi WTSI Slit Lamp / cornea opacity HOM 3f:0m - 1.00 FAILED - Not enough mutant or control data
Sgo2atm1a(EUCOMM)Wtsi WTSI Slit Lamp / lens HOM 7f:9m Fisher Exact Test framework 1.00 Success
Sgo2atm1a(EUCOMM)Wtsi WTSI Slit Lamp / lens HOM 3f:0m - 1.00 FAILED - Not enough mutant or control data
Sgo2atm1a(EUCOMM)Wtsi WTSI Slit Lamp / lens HOM 7f:9m Fisher Exact Test framework 1.00 Success
Sgo2atm1a(EUCOMM)Wtsi WTSI Slit Lamp / lens HOM 3f:0m - 1.00 FAILED - Not enough mutant or control data
Sgo2atm1a(EUCOMM)Wtsi WTSI X-ray / Shape of vertebrae HOM 3f:0m - 1.00 FAILED - Not enough mutant or control data
Sgo2atm1a(EUCOMM)Wtsi WTSI X-ray / Shape of vertebrae HOM 3f:0m - 1.00 FAILED - Not enough mutant or control data
Sgo2atm1a(EUCOMM)Wtsi WTSI X-ray / Shape of vertebrae HOM 7f:9m Fisher Exact Test framework 1.00 Success
Sgo2atm1a(EUCOMM)Wtsi WTSI X-ray / Shape of vertebrae HOM 7f:9m Fisher Exact Test framework 1.00 Success
Sgo2atm1a(EUCOMM)Wtsi WTSI Slit Lamp / Eye HOM 7f:9m Fisher Exact Test framework 0.749 Success
Sgo2atm1a(EUCOMM)Wtsi WTSI Slit Lamp / Eye HOM 7f:9m Fisher Exact Test framework 0.749 Success
Sgo2atm1a(EUCOMM)Wtsi WTSI Slit Lamp / Eye HOM 3f:0m - 1.00 FAILED - Not enough mutant or control data
Sgo2atm1a(EUCOMM)Wtsi WTSI Slit Lamp / Eye HOM 3f:0m - 1.00 FAILED - Not enough mutant or control data
Sgo2atm1a(EUCOMM)Wtsi WTSI X-ray / Number of thoracic vertebrae HOM 3f:0m Not processed 1.00 FAILED - Not enough mutant or control data
Sgo2atm1a(EUCOMM)Wtsi WTSI X-ray / Number of thoracic vertebrae HOM 3f:0m Not processed 1.00 FAILED - Not enough mutant or control data
Sgo2atm1a(EUCOMM)Wtsi WTSI X-ray / Number of thoracic vertebrae HOM 7f:9m Not processed 1.00 FAILED - No variability in dependent variable 'M.G.P_006_001_031'.
Sgo2atm1a(EUCOMM)Wtsi WTSI X-ray / Number of thoracic vertebrae HOM 7f:9m Not processed 1.00 FAILED - No variability in dependent variable 'M.G.P_006_001_031'.
Sgo2atm1a(EUCOMM)Wtsi WTSI Slit Lamp / Eye (+) blood presence HOM 7f:9m Fisher Exact Test framework 1.00 Not tested (No variation) - OK
Sgo2atm1a(EUCOMM)Wtsi WTSI Slit Lamp / Eye (+) blood presence HOM 7f:9m Fisher Exact Test framework 1.00 Not tested (No variation) - OK
Sgo2atm1a(EUCOMM)Wtsi WTSI Slit Lamp / Eye (+) blood presence HOM 3f:0m - 1.00 FAILED - Not enough mutant or control data
Sgo2atm1a(EUCOMM)Wtsi WTSI Slit Lamp / Eye (+) blood presence HOM 3f:0m - 1.00 FAILED - Not enough mutant or control data
Sgo2atm1a(EUCOMM)Wtsi WTSI Slit Lamp / Eye size HOM 7f:9m Fisher Exact Test framework 1.00 Not tested (No variation) - OK
Sgo2atm1a(EUCOMM)Wtsi WTSI Slit Lamp / Eye size HOM 7f:9m Fisher Exact Test framework 1.00 Not tested (No variation) - OK
Sgo2atm1a(EUCOMM)Wtsi WTSI Slit Lamp / Eye size HOM 3f:0m - 1.00 FAILED - Not enough mutant or control data
Sgo2atm1a(EUCOMM)Wtsi WTSI Slit Lamp / Eye size HOM 3f:0m - 1.00 FAILED - Not enough mutant or control data
Sgo2atm1a(EUCOMM)Wtsi WTSI Slit Lamp / cornea HOM 7f:9m Fisher Exact Test framework 1.00 Success
Sgo2atm1a(EUCOMM)Wtsi WTSI Slit Lamp / cornea HOM 3f:0m - 1.00 FAILED - Not enough mutant or control data
Sgo2atm1a(EUCOMM)Wtsi WTSI Slit Lamp / cornea HOM 7f:9m Fisher Exact Test framework 1.00 Success
Sgo2atm1a(EUCOMM)Wtsi WTSI Slit Lamp / cornea HOM 3f:0m - 1.00 FAILED - Not enough mutant or control data
Sgo2atm1a(EUCOMM)Wtsi WTSI X-ray / Tibia Length HOM 3f:0m Not processed 1.00 FAILED - Not enough mutant or control data
Sgo2atm1a(EUCOMM)Wtsi WTSI X-ray / Tibia Length HOM 3f:0m Not processed 1.00 FAILED - Not enough mutant or control data
Sgo2atm1a(EUCOMM)Wtsi WTSI Slit Lamp / Eyelid closure HOM 7f:9m Fisher Exact Test framework 1.00 Success
Sgo2atm1a(EUCOMM)Wtsi WTSI Slit Lamp / Eyelid closure HOM 3f:0m - 1.00 FAILED - Not enough mutant or control data
Sgo2atm1a(EUCOMM)Wtsi WTSI Slit Lamp / Eyelid closure HOM 7f:9m Fisher Exact Test framework 1.00 Success
Sgo2atm1a(EUCOMM)Wtsi WTSI Slit Lamp / Eyelid closure HOM 3f:0m - 1.00 FAILED - Not enough mutant or control data
Sgo2atm1a(EUCOMM)Wtsi WTSI Buffy coat peripheral blood leukocyte immunophenotyping / CD4+CD44+CD62L- percentage HOM 7f:9m Mixed Model framework, linear mixed-effects model, equation withoutWeight 0.0151 Success
Sgo2atm1a(EUCOMM)Wtsi WTSI Antigen Specific Immunoglobulin Assay / TetC specific IgG2 HOM 3f:0m Not processed 1.00 FAILED - Not enough mutant or control data
Sgo2atm1a(EUCOMM)Wtsi WTSI Slit Lamp / Iris/Pupil HOM 7f:9m Fisher Exact Test framework 1.00 Success
Sgo2atm1a(EUCOMM)Wtsi WTSI Slit Lamp / Iris/Pupil HOM 3f:0m - 1.00 FAILED - Not enough mutant or control data
Sgo2atm1a(EUCOMM)Wtsi WTSI Slit Lamp / Iris/Pupil HOM 7f:9m Fisher Exact Test framework 1.00 Success
Sgo2atm1a(EUCOMM)Wtsi WTSI Slit Lamp / Iris/Pupil HOM 3f:0m - 1.00 FAILED - Not enough mutant or control data
Sgo2atm1a(EUCOMM)Wtsi WTSI Slit Lamp / lens opacity HOM 7f:9m Fisher Exact Test framework 1.00 Success
Sgo2atm1a(EUCOMM)Wtsi WTSI Slit Lamp / lens opacity HOM 3f:0m - 1.00 FAILED - Not enough mutant or control data
Sgo2atm1a(EUCOMM)Wtsi WTSI Slit Lamp / lens opacity HOM 7f:9m Fisher Exact Test framework 1.00 Success
Sgo2atm1a(EUCOMM)Wtsi WTSI Slit Lamp / lens opacity HOM 3f:0m - 1.00 FAILED - Not enough mutant or control data
Sgo2atm1a(EUCOMM)Wtsi WTSI Slit Lamp / Iris/Pupil shape HOM 7f:9m Fisher Exact Test framework 1.00 Success
Sgo2atm1a(EUCOMM)Wtsi WTSI Slit Lamp / Iris/Pupil shape HOM 3f:0m - 1.00 FAILED - Not enough mutant or control data
Sgo2atm1a(EUCOMM)Wtsi WTSI Slit Lamp / Iris/Pupil shape HOM 7f:9m Fisher Exact Test framework 1.00 Success
Sgo2atm1a(EUCOMM)Wtsi WTSI Slit Lamp / Iris/Pupil shape HOM 3f:0m - 1.00 FAILED - Not enough mutant or control data
Sgo2atm1a(EUCOMM)Wtsi WTSI Slit Lamp / Iris/Pupil position HOM 7f:9m Fisher Exact Test framework 1.00 Success
Sgo2atm1a(EUCOMM)Wtsi WTSI Slit Lamp / Iris/Pupil position HOM 3f:0m - 1.00 FAILED - Not enough mutant or control data
Sgo2atm1a(EUCOMM)Wtsi WTSI Slit Lamp / Iris/Pupil position HOM 7f:9m Fisher Exact Test framework 1.00 Success
Sgo2atm1a(EUCOMM)Wtsi WTSI Slit Lamp / Iris/Pupil position HOM 3f:0m - 1.00 FAILED - Not enough mutant or control data
Sgo2atm1a(EUCOMM)Wtsi WTSI Slit Lamp / Iris pigment HOM 3f:0m - 1.00 FAILED - Not enough mutant or control data
Sgo2atm1a(EUCOMM)Wtsi WTSI Slit Lamp / Iris pigment HOM 7f:9m Fisher Exact Test framework 1.00 Not tested (No variation) - OK
Sgo2atm1a(EUCOMM)Wtsi WTSI Slit Lamp / Iris pigment HOM 7f:9m Fisher Exact Test framework 1.00 Not tested (No variation) - OK
Sgo2atm1a(EUCOMM)Wtsi WTSI Slit Lamp / Iris pigment HOM 3f:0m - 1.00 FAILED - Not enough mutant or control data
Sgo2atm1a(EUCOMM)Wtsi WTSI Slit Lamp / Iris/Pupil light response HOM 7f:9m Fisher Exact Test framework 1.00 Success
Sgo2atm1a(EUCOMM)Wtsi WTSI Slit Lamp / Iris/Pupil light response HOM 3f:0m - 1.00 FAILED - Not enough mutant or control data
Sgo2atm1a(EUCOMM)Wtsi WTSI Slit Lamp / Iris/Pupil light response HOM 7f:9m Fisher Exact Test framework 1.00 Success
Sgo2atm1a(EUCOMM)Wtsi WTSI Slit Lamp / Iris/Pupil light response HOM 3f:0m - 1.00 FAILED - Not enough mutant or control data
Sgo2atm1a(EUCOMM)Wtsi WTSI Slit Lamp / Digitial Image/s HOM 3f:0m Not processed 1.00 FAILED - Not enough mutant or control data
Sgo2atm1a(EUCOMM)Wtsi WTSI Slit Lamp / Digitial Image/s HOM 3f:0m Not processed 1.00 FAILED - Not enough mutant or control data
Sgo2atm1a(EUCOMM)Wtsi WTSI Modified SHIRPA / Body Position HOM 7f:9m Fisher Exact Test framework 1.00 Success
Sgo2atm1a(EUCOMM)Wtsi WTSI Modified SHIRPA / Body Position HOM 3f:0m - 1.00 FAILED - Not enough mutant or control data
Sgo2atm1a(EUCOMM)Wtsi WTSI Modified SHIRPA / Body Position HOM 7f:9m Fisher Exact Test framework 1.00 Success
Sgo2atm1a(EUCOMM)Wtsi WTSI Modified SHIRPA / Body Position HOM 3f:0m - 1.00 FAILED - Not enough mutant or control data
Sgo2atm1a(EUCOMM)Wtsi WTSI Modified SHIRPA / Defecation HOM 7f:9m Fisher Exact Test framework 0.798 Success
Sgo2atm1a(EUCOMM)Wtsi WTSI Modified SHIRPA / Defecation HOM 7f:9m Fisher Exact Test framework 0.798 Success
Sgo2atm1a(EUCOMM)Wtsi WTSI Modified SHIRPA / Defecation HOM 3f:0m - 1.00 FAILED - Not enough mutant or control data
Sgo2atm1a(EUCOMM)Wtsi WTSI Modified SHIRPA / Defecation HOM 3f:0m - 1.00 FAILED - Not enough mutant or control data
Sgo2atm1a(EUCOMM)Wtsi WTSI Modified SHIRPA / Tremor HOM 3f:0m - 1.00 FAILED - Not enough mutant or control data
Sgo2atm1a(EUCOMM)Wtsi WTSI Modified SHIRPA / Tremor HOM 3f:0m - 1.00 FAILED - Not enough mutant or control data
Sgo2atm1a(EUCOMM)Wtsi WTSI Modified SHIRPA / Tremor HOM 7f:9m Fisher Exact Test framework 1.00 Success
Sgo2atm1a(EUCOMM)Wtsi WTSI Modified SHIRPA / Tremor HOM 7f:9m Fisher Exact Test framework 1.00 Success
Sgo2atm1a(EUCOMM)Wtsi WTSI Modified SHIRPA / Palpebral Closure HOM 3f:0m - 1.00 FAILED - Not enough mutant or control data
Sgo2atm1a(EUCOMM)Wtsi WTSI Modified SHIRPA / Palpebral Closure HOM 3f:0m - 1.00 FAILED - Not enough mutant or control data
Sgo2atm1a(EUCOMM)Wtsi WTSI Modified SHIRPA / Palpebral Closure HOM 7f:9m Fisher Exact Test framework 1.00 Success
Sgo2atm1a(EUCOMM)Wtsi WTSI Modified SHIRPA / Palpebral Closure HOM 7f:9m Fisher Exact Test framework 1.00 Success
Sgo2atm1a(EUCOMM)Wtsi WTSI Modified SHIRPA / Urination HOM 7f:9m Fisher Exact Test framework 0.529 Success
Sgo2atm1a(EUCOMM)Wtsi WTSI Modified SHIRPA / Urination HOM 7f:9m Fisher Exact Test framework 0.529 Success
Sgo2atm1a(EUCOMM)Wtsi WTSI Modified SHIRPA / Urination HOM 3f:0m - 1.00 FAILED - Not enough mutant or control data
Sgo2atm1a(EUCOMM)Wtsi WTSI Modified SHIRPA / Urination HOM 3f:0m - 1.00 FAILED - Not enough mutant or control data
Sgo2atm1a(EUCOMM)Wtsi WTSI Modified SHIRPA / Transfer Arousal HOM 7f:9m Fisher Exact Test framework 0.336 Success
Sgo2atm1a(EUCOMM)Wtsi WTSI Modified SHIRPA / Transfer Arousal HOM 7f:9m Fisher Exact Test framework 0.336 Success
Sgo2atm1a(EUCOMM)Wtsi WTSI Modified SHIRPA / Transfer Arousal HOM 3f:0m - 1.00 FAILED - Not enough mutant or control data
Sgo2atm1a(EUCOMM)Wtsi WTSI Modified SHIRPA / Transfer Arousal HOM 3f:0m - 1.00 FAILED - Not enough mutant or control data
Sgo2atm1a(EUCOMM)Wtsi WTSI Modified SHIRPA / Lacrimation HOM 3f:0m - 1.00 FAILED - Not enough mutant or control data
Sgo2atm1a(EUCOMM)Wtsi WTSI Modified SHIRPA / Lacrimation HOM 3f:0m - 1.00 FAILED - Not enough mutant or control data
Sgo2atm1a(EUCOMM)Wtsi WTSI Modified SHIRPA / Lacrimation HOM 7f:9m Fisher Exact Test framework 1.00 Not tested (No variation) - OK
Sgo2atm1a(EUCOMM)Wtsi WTSI Modified SHIRPA / Lacrimation HOM 7f:9m Fisher Exact Test framework 1.00 Not tested (No variation) - OK
Sgo2atm1a(EUCOMM)Wtsi WTSI Modified SHIRPA / Gait HOM 3f:0m - 1.00 FAILED - Not enough mutant or control data
Sgo2atm1a(EUCOMM)Wtsi WTSI Modified SHIRPA / Gait HOM 3f:0m - 1.00 FAILED - Not enough mutant or control data
Sgo2atm1a(EUCOMM)Wtsi WTSI Modified SHIRPA / Gait HOM 7f:9m Fisher Exact Test framework 1.00 Success
Sgo2atm1a(EUCOMM)Wtsi WTSI Modified SHIRPA / Gait HOM 7f:9m Fisher Exact Test framework 1.00 Success
Sgo2atm1a(EUCOMM)Wtsi WTSI Modified SHIRPA / Locomotor activity HOM 7f:9m Mixed Model framework, generalized least squares, equation withoutWeight 0.986 Success
Sgo2atm1a(EUCOMM)Wtsi WTSI Modified SHIRPA / Locomotor activity HOM 7f:9m Mixed Model framework, generalized least squares, equation withoutWeight 0.986 Success
Sgo2atm1a(EUCOMM)Wtsi WTSI Modified SHIRPA / Locomotor activity HOM 3f:0m Not processed 1.00 FAILED - Not enough mutant or control data
Sgo2atm1a(EUCOMM)Wtsi WTSI Modified SHIRPA / Locomotor activity HOM 3f:0m Not processed 1.00 FAILED - Not enough mutant or control data
Sgo2atm1a(EUCOMM)Wtsi WTSI Fertility of Homozygous Knock-out Mice / Gross Findings Female HOM f:m Supplied as data Success
Sgo2atm1a(EUCOMM)Wtsi WTSI Modified SHIRPA / Tail elevation HOM 7f:9m Fisher Exact Test framework 1.00 Success
Sgo2atm1a(EUCOMM)Wtsi WTSI Modified SHIRPA / Tail elevation HOM 3f:0m - 1.00 FAILED - Not enough mutant or control data
Sgo2atm1a(EUCOMM)Wtsi WTSI Modified SHIRPA / Tail elevation HOM 3f:0m - 1.00 FAILED - Not enough mutant or control data
Sgo2atm1a(EUCOMM)Wtsi WTSI Modified SHIRPA / Tail elevation HOM 7f:9m Fisher Exact Test framework 1.00 Success
Sgo2atm1a(EUCOMM)Wtsi WTSI Modified SHIRPA / Pelvic elevation HOM 7f:9m Fisher Exact Test framework 0.206 Success
Sgo2atm1a(EUCOMM)Wtsi WTSI Modified SHIRPA / Pelvic elevation HOM 7f:9m Fisher Exact Test framework 0.206 Success
Sgo2atm1a(EUCOMM)Wtsi WTSI Modified SHIRPA / Pelvic elevation HOM 3f:0m - 1.00 FAILED - Not enough mutant or control data
Sgo2atm1a(EUCOMM)Wtsi WTSI Modified SHIRPA / Pelvic elevation HOM 3f:0m - 1.00 FAILED - Not enough mutant or control data
Sgo2atm1a(EUCOMM)Wtsi WTSI Modified SHIRPA / Touch Escape HOM 7f:9m Fisher Exact Test framework 0.545 Success
Sgo2atm1a(EUCOMM)Wtsi WTSI Modified SHIRPA / Touch Escape HOM 7f:9m Fisher Exact Test framework 0.545 Success
Sgo2atm1a(EUCOMM)Wtsi WTSI Modified SHIRPA / Touch Escape HOM 3f:0m - 1.00 FAILED - Not enough mutant or control data
Sgo2atm1a(EUCOMM)Wtsi WTSI Modified SHIRPA / Touch Escape HOM 3f:0m - 1.00 FAILED - Not enough mutant or control data
Sgo2atm1a(EUCOMM)Wtsi WTSI Modified SHIRPA / Startle Response HOM 7f:9m Fisher Exact Test framework 1.00 Success
Sgo2atm1a(EUCOMM)Wtsi WTSI Modified SHIRPA / Startle Response HOM 3f:0m - 1.00 FAILED - Not enough mutant or control data
Sgo2atm1a(EUCOMM)Wtsi WTSI Modified SHIRPA / Startle Response HOM 3f:0m - 1.00 FAILED - Not enough mutant or control data
Sgo2atm1a(EUCOMM)Wtsi WTSI Modified SHIRPA / Startle Response HOM 7f:9m Fisher Exact Test framework 1.00 Success
Sgo2atm1a(EUCOMM)Wtsi WTSI Modified SHIRPA / Trunk Curl HOM 3f:0m - 1.00 FAILED - Not enough mutant or control data
Sgo2atm1a(EUCOMM)Wtsi WTSI Modified SHIRPA / Trunk Curl HOM 3f:0m - 1.00 FAILED - Not enough mutant or control data
Sgo2atm1a(EUCOMM)Wtsi WTSI Modified SHIRPA / Trunk Curl HOM 7f:9m Fisher Exact Test framework 1.00 Not tested (No variation) - OK
Sgo2atm1a(EUCOMM)Wtsi WTSI Modified SHIRPA / Trunk Curl HOM 7f:9m Fisher Exact Test framework 1.00 Not tested (No variation) - OK
Sgo2atm1a(EUCOMM)Wtsi WTSI Modified SHIRPA / Positional Passivity HOM 3f:0m - 1.00 FAILED - Not enough mutant or control data
Sgo2atm1a(EUCOMM)Wtsi WTSI Modified SHIRPA / Positional Passivity HOM 3f:0m - 1.00 FAILED - Not enough mutant or control data
Sgo2atm1a(EUCOMM)Wtsi WTSI Modified SHIRPA / Positional Passivity HOM 7f:9m Fisher Exact Test framework 1.00 Success
Sgo2atm1a(EUCOMM)Wtsi WTSI Modified SHIRPA / Positional Passivity HOM 7f:9m Fisher Exact Test framework 1.00 Success
Sgo2atm1a(EUCOMM)Wtsi WTSI Modified SHIRPA / Pinna Reflex HOM 3f:0m - 1.00 FAILED - Not enough mutant or control data
Sgo2atm1a(EUCOMM)Wtsi WTSI Modified SHIRPA / Pinna Reflex HOM 3f:0m - 1.00 FAILED - Not enough mutant or control data
Sgo2atm1a(EUCOMM)Wtsi WTSI Modified SHIRPA / Pinna Reflex HOM 7f:9m Fisher Exact Test framework 1.00 Not tested (No variation) - OK
Sgo2atm1a(EUCOMM)Wtsi WTSI Modified SHIRPA / Pinna Reflex HOM 7f:9m Fisher Exact Test framework 1.00 Not tested (No variation) - OK
Sgo2atm1a(EUCOMM)Wtsi WTSI Modified SHIRPA / Limb Grasping HOM 3f:0m - 1.00 FAILED - Not enough mutant or control data
Sgo2atm1a(EUCOMM)Wtsi WTSI Modified SHIRPA / Limb Grasping HOM 7f:9m Fisher Exact Test framework 1.00 Not tested (No variation) - OK
Sgo2atm1a(EUCOMM)Wtsi WTSI Modified SHIRPA / Limb Grasping HOM 3f:0m - 1.00 FAILED - Not enough mutant or control data
Sgo2atm1a(EUCOMM)Wtsi WTSI Modified SHIRPA / Limb Grasping HOM 7f:9m Fisher Exact Test framework 1.00 Not tested (No variation) - OK
Sgo2atm1a(EUCOMM)Wtsi WTSI Modified SHIRPA / Corneal Reflex HOM 7f:9m Fisher Exact Test framework 1.00 Not tested (No variation) - OK
Sgo2atm1a(EUCOMM)Wtsi WTSI Modified SHIRPA / Corneal Reflex HOM 3f:0m - 1.00 FAILED - Not enough mutant or control data
Sgo2atm1a(EUCOMM)Wtsi WTSI Modified SHIRPA / Corneal Reflex HOM 7f:9m Fisher Exact Test framework 1.00 Not tested (No variation) - OK
Sgo2atm1a(EUCOMM)Wtsi WTSI Modified SHIRPA / Corneal Reflex HOM 3f:0m - 1.00 FAILED - Not enough mutant or control data
Sgo2atm1a(EUCOMM)Wtsi WTSI Dexa-scan analysis / Weight HOM 7f:9m Mixed Model framework, linear mixed-effects model, equation withoutWeight 0.0265 Success
Sgo2atm1a(EUCOMM)Wtsi WTSI Dexa-scan analysis / Weight HOM 7f:9m Mixed Model framework, linear mixed-effects model, equation withoutWeight 0.0265 Success
Sgo2atm1a(EUCOMM)Wtsi WTSI Dexa-scan analysis / Weight HOM 3f:0m Not processed 1.00 FAILED - Not enough mutant or control data
Sgo2atm1a(EUCOMM)Wtsi WTSI Dexa-scan analysis / Weight HOM 3f:0m Not processed 1.00 FAILED - Not enough mutant or control data
Sgo2atm1a(EUCOMM)Wtsi WTSI Dexa-scan analysis / Fat Mass HOM 7f:9m Mixed Model framework, linear mixed-effects model, equation withoutWeight 0.0668 Success
Sgo2atm1a(EUCOMM)Wtsi WTSI Dexa-scan analysis / Fat Mass HOM 7f:9m Mixed Model framework, linear mixed-effects model, equation withoutWeight 0.0668 Success
Sgo2atm1a(EUCOMM)Wtsi WTSI Dexa-scan analysis / Fat Mass HOM 3f:0m Not processed 1.00 FAILED - Not enough mutant or control data
Sgo2atm1a(EUCOMM)Wtsi WTSI Dexa-scan analysis / Fat Mass HOM 3f:0m Not processed 1.00 FAILED - Not enough mutant or control data
Sgo2atm1a(EUCOMM)Wtsi WTSI Dexa-scan analysis / Lean Mass HOM 7f:9m Mixed Model framework, linear mixed-effects model, equation withoutWeight 0.0609 Success
Sgo2atm1a(EUCOMM)Wtsi WTSI Dexa-scan analysis / Lean Mass HOM 7f:9m Mixed Model framework, linear mixed-effects model, equation withoutWeight 0.0609 Success
Sgo2atm1a(EUCOMM)Wtsi WTSI Dexa-scan analysis / Lean Mass HOM 3f:0m Not processed 1.00 FAILED - Not enough mutant or control data
Sgo2atm1a(EUCOMM)Wtsi WTSI Dexa-scan analysis / Lean Mass HOM 3f:0m Not processed 1.00 FAILED - Not enough mutant or control data
Sgo2atm1a(EUCOMM)Wtsi WTSI Dexa-scan analysis / Bone Mineral Density (excluding skull) HOM 7f:9m Mixed Model framework, linear mixed-effects model, equation withoutWeight 0.331 Success
Sgo2atm1a(EUCOMM)Wtsi WTSI Dexa-scan analysis / Bone Mineral Density (excluding skull) HOM 7f:9m Mixed Model framework, linear mixed-effects model, equation withoutWeight 0.331 Success
Sgo2atm1a(EUCOMM)Wtsi WTSI Dexa-scan analysis / Bone Mineral Density (excluding skull) HOM 3f:0m Not processed 1.00 FAILED - Not enough mutant or control data
Sgo2atm1a(EUCOMM)Wtsi WTSI Dexa-scan analysis / Bone Mineral Density (excluding skull) HOM 3f:0m Not processed 1.00 FAILED - Not enough mutant or control data
Sgo2atm1a(EUCOMM)Wtsi WTSI Dexa-scan analysis / Bone Mineral Content HOM 7f:9m Mixed Model framework, linear mixed-effects model, equation withoutWeight 0.246 Success
Sgo2atm1a(EUCOMM)Wtsi WTSI Dexa-scan analysis / Bone Mineral Content HOM 7f:9m Mixed Model framework, linear mixed-effects model, equation withoutWeight 0.246 Success
Sgo2atm1a(EUCOMM)Wtsi WTSI Dexa-scan analysis / Bone Mineral Content HOM 3f:0m Not processed 1.00 FAILED - Not enough mutant or control data
Sgo2atm1a(EUCOMM)Wtsi WTSI Dexa-scan analysis / Bone Mineral Content HOM 3f:0m Not processed 1.00 FAILED - Not enough mutant or control data
Sgo2atm1a(EUCOMM)Wtsi WTSI Dexa-scan analysis / Body Length HOM 7f:9m Mixed Model framework, linear mixed-effects model, equation withoutWeight 0.0469 Success
Sgo2atm1a(EUCOMM)Wtsi WTSI Dexa-scan analysis / Body Length HOM 7f:9m Mixed Model framework, linear mixed-effects model, equation withoutWeight 0.0469 Success
Sgo2atm1a(EUCOMM)Wtsi WTSI Dexa-scan analysis / Body Length HOM 3f:0m Not processed 1.00 FAILED - Not enough mutant or control data
Sgo2atm1a(EUCOMM)Wtsi WTSI Dexa-scan analysis / Body Length HOM 3f:0m Not processed 1.00 FAILED - Not enough mutant or control data
Sgo2atm1a(EUCOMM)Wtsi WTSI Dysmorphology / Head morphology HOM 3f:0m - 1.00 FAILED - Not enough mutant or control data
Sgo2atm1a(EUCOMM)Wtsi WTSI Dysmorphology / Head morphology HOM 3f:0m - 1.00 FAILED - Not enough mutant or control data
Sgo2atm1a(EUCOMM)Wtsi WTSI Dysmorphology / Head morphology HOM 7f:9m Fisher Exact Test framework 1.00 Not tested (No variation) - OK
Sgo2atm1a(EUCOMM)Wtsi WTSI Dysmorphology / Head morphology HOM 7f:9m Fisher Exact Test framework 1.00 Not tested (No variation) - OK
Sgo2atm1a(EUCOMM)Wtsi WTSI Dysmorphology / Head size HOM 3f:0m - 1.00 FAILED - Not enough mutant or control data
Sgo2atm1a(EUCOMM)Wtsi WTSI Dysmorphology / Head size HOM 3f:0m - 1.00 FAILED - Not enough mutant or control data
Sgo2atm1a(EUCOMM)Wtsi WTSI Dysmorphology / Head size HOM 7f:9m Fisher Exact Test framework 1.00 Not tested (No variation) - OK
Sgo2atm1a(EUCOMM)Wtsi WTSI Dysmorphology / Head size HOM 7f:9m Fisher Exact Test framework 1.00 Not tested (No variation) - OK
Sgo2atm1a(EUCOMM)Wtsi WTSI Dysmorphology / Skin pigmentation HOM 7f:9m Fisher Exact Test framework 0.000395 Success
Sgo2atm1a(EUCOMM)Wtsi WTSI Dysmorphology / Skin pigmentation HOM 7f:9m Fisher Exact Test framework 0.000395 Success
Sgo2atm1a(EUCOMM)Wtsi WTSI Dysmorphology / Skin pigmentation HOM 3f:0m - 1.00 FAILED - Not enough mutant or control data
Sgo2atm1a(EUCOMM)Wtsi WTSI Dysmorphology / Skin pigmentation HOM 3f:0m - 1.00 FAILED - Not enough mutant or control data
Sgo2atm1a(EUCOMM)Wtsi WTSI Dysmorphology / Skin condition HOM 7f:9m Fisher Exact Test framework 1.00 Success
Sgo2atm1a(EUCOMM)Wtsi WTSI Dysmorphology / Skin condition HOM 3f:0m - 1.00 FAILED - Not enough mutant or control data
Sgo2atm1a(EUCOMM)Wtsi WTSI Dysmorphology / Skin condition HOM 3f:0m - 1.00 FAILED - Not enough mutant or control data
Sgo2atm1a(EUCOMM)Wtsi WTSI Dysmorphology / Skin condition HOM 7f:9m Fisher Exact Test framework 1.00 Success
Sgo2atm1a(EUCOMM)Wtsi WTSI Modified SHIRPA / Evidence of Biting HOM 7f:9m Fisher Exact Test framework 0.262 Success
Sgo2atm1a(EUCOMM)Wtsi WTSI Modified SHIRPA / Evidence of Biting HOM 7f:9m Fisher Exact Test framework 0.262 Success
Sgo2atm1a(EUCOMM)Wtsi WTSI Modified SHIRPA / Evidence of Biting HOM 3f:0m - 1.00 FAILED - Not enough mutant or control data
Sgo2atm1a(EUCOMM)Wtsi WTSI Modified SHIRPA / Evidence of Biting HOM 3f:0m - 1.00 FAILED - Not enough mutant or control data
Sgo2atm1a(EUCOMM)Wtsi WTSI Buffy coat peripheral blood leukocyte immunophenotyping / Treg cell CD25+ percentage HOM 7f:9m Mixed Model framework, linear mixed-effects model, equation withoutWeight 0.0970 Success
Sgo2atm1a(EUCOMM)Wtsi WTSI Modified SHIRPA / Contact Righting Reflex HOM 7f:9m Fisher Exact Test framework 1.00 Not tested (No variation) - OK
Sgo2atm1a(EUCOMM)Wtsi WTSI Modified SHIRPA / Contact Righting Reflex HOM 3f:0m - 1.00 FAILED - Not enough mutant or control data
Sgo2atm1a(EUCOMM)Wtsi WTSI Modified SHIRPA / Contact Righting Reflex HOM 3f:0m - 1.00 FAILED - Not enough mutant or control data
Sgo2atm1a(EUCOMM)Wtsi WTSI Modified SHIRPA / Contact Righting Reflex HOM 7f:9m Fisher Exact Test framework 1.00 Not tested (No variation) - OK
Sgo2atm1a(EUCOMM)Wtsi WTSI Modified SHIRPA / Vocalization HOM 7f:9m Fisher Exact Test framework 0.401 Success
Sgo2atm1a(EUCOMM)Wtsi WTSI Modified SHIRPA / Vocalization HOM 7f:9m Fisher Exact Test framework 0.401 Success
Sgo2atm1a(EUCOMM)Wtsi WTSI Modified SHIRPA / Vocalization HOM 3f:0m - 1.00 FAILED - Not enough mutant or control data
Sgo2atm1a(EUCOMM)Wtsi WTSI Modified SHIRPA / Vocalization HOM 3f:0m - 1.00 FAILED - Not enough mutant or control data
Sgo2atm1a(EUCOMM)Wtsi WTSI Dysmorphology / Body fat distribution HOM 7f:9m Fisher Exact Test framework 1.00 Not tested (No variation) - OK
Sgo2atm1a(EUCOMM)Wtsi WTSI Dysmorphology / Body fat distribution HOM 7f:9m Fisher Exact Test framework 1.00 Not tested (No variation) - OK
Sgo2atm1a(EUCOMM)Wtsi WTSI Dysmorphology / Body fat distribution HOM 3f:0m - 1.00 FAILED - Not enough mutant or control data
Sgo2atm1a(EUCOMM)Wtsi WTSI Dysmorphology / Body fat distribution HOM 3f:0m - 1.00 FAILED - Not enough mutant or control data
Sgo2atm1a(EUCOMM)Wtsi WTSI Dysmorphology / Coat texture HOM 7f:9m Fisher Exact Test framework 0.102 Success
Sgo2atm1a(EUCOMM)Wtsi WTSI Dysmorphology / Coat texture HOM 7f:9m Fisher Exact Test framework 0.102 Success
Sgo2atm1a(EUCOMM)Wtsi WTSI Dysmorphology / Coat texture HOM 3f:0m - 1.00 FAILED - Not enough mutant or control data
Sgo2atm1a(EUCOMM)Wtsi WTSI Dysmorphology / Coat texture HOM 3f:0m - 1.00 FAILED - Not enough mutant or control data
Sgo2atm1a(EUCOMM)Wtsi WTSI Dysmorphology / Coat colouration HOM 7f:9m Fisher Exact Test framework 0.0165 Success
Sgo2atm1a(EUCOMM)Wtsi WTSI Dysmorphology / Coat colouration HOM 7f:9m Fisher Exact Test framework 0.0165 Success
Sgo2atm1a(EUCOMM)Wtsi WTSI Dysmorphology / Coat colouration HOM 3f:0m - 1.00 FAILED - Not enough mutant or control data
Sgo2atm1a(EUCOMM)Wtsi WTSI Dysmorphology / Coat colouration HOM 3f:0m - 1.00 FAILED - Not enough mutant or control data
Sgo2atm1a(EUCOMM)Wtsi WTSI Dysmorphology / Coat intact HOM 7f:9m Fisher Exact Test framework 1.00 Success
Sgo2atm1a(EUCOMM)Wtsi WTSI Dysmorphology / Coat intact HOM 3f:0m - 1.00 FAILED - Not enough mutant or control data
Sgo2atm1a(EUCOMM)Wtsi WTSI Dysmorphology / Coat intact HOM 3f:0m - 1.00 FAILED - Not enough mutant or control data
Sgo2atm1a(EUCOMM)Wtsi WTSI Dysmorphology / Coat intact HOM 7f:9m Fisher Exact Test framework 1.00 Success
Sgo2atm1a(EUCOMM)Wtsi WTSI Dysmorphology / Muscle development HOM 7f:9m Fisher Exact Test framework 1.00 Not tested (No variation) - OK
Sgo2atm1a(EUCOMM)Wtsi WTSI Dysmorphology / Muscle development HOM 3f:0m - 1.00 FAILED - Not enough mutant or control data
Sgo2atm1a(EUCOMM)Wtsi WTSI Dysmorphology / Muscle development HOM 3f:0m - 1.00 FAILED - Not enough mutant or control data
Sgo2atm1a(EUCOMM)Wtsi WTSI Dysmorphology / Muscle development HOM 7f:9m Fisher Exact Test framework 1.00 Not tested (No variation) - OK

 Expression

IMPC lacZ Expression Data

 Expression  No Expression  Ambiguous  No Tissue Available
Anatomy #HET Specimens HOM Images? WT Expr Mutant Expr Images
Adrenal gland 2 No  (2/584) N/A
Aorta 2 No N/A
Blood vessel 2 No N/A
Bone 2 No N/A
Brain 2 No N/A
Brainstem 2 No N/A
Brown adipose tissue 2 No N/A
Cartilage tissue 2 No N/A
Cerebellum 2 No N/A
Cerebral cortex 2 No N/A
Eye 2 No N/A
Gall bladder 2 No N/A
Heart 2 No N/A
Hippocampus 2 No N/A
Hypothalamus 2 No N/A
Kidney 2 No  (18/584) N/A
Large intestine 2 No  (10/584) N/A
Liver 2 No N/A
Lower urinary tract 2 No N/A
Lung 2 No N/A
Lymph node 2 No  (2/2) N/A
Mammary gland 2 No N/A
Esophagus 2 No N/A
Olfactory lobe 2 No N/A
Ovary 2 No  (1/584)  (1/2) N/A
Oviduct 2 No N/A
Pancreas 2 No  (5/584) N/A
Parathyroid gland 2 No N/A
Peripheral nervous system 2 No N/A
Peyer's patch 2 No  (2/2) N/A
Pituitary gland 2 No N/A
Prostate gland 2 No  (12/584) N/A
Skeletal muscle tissue 2 No N/A
Skin 2 No N/A
Small intestine 2 No  (9/584) N/A
Spinal cord 2 No N/A
Spleen 2 No  (2/584)  (2/2) N/A
Stomach 2 No  (12/584) N/A
Striatum 2 No N/A
Testis 2 No  (2/584)  (1/2) N/A
Thymus 2 No  (2/2) N/A
Thyroid gland 2 No  (15/584) N/A
Trachea 2 No N/A
Uterus 2 No N/A
White adipose tissue 2 No N/A
No Embryo expression data was found for this gene.

 Associated Images

Phenotype associated images not available

 Disease Models

No associations by disease annotation and gene orthology found.
Please visit the desktop version to see this section

 Order Mouse and ES Cells

MGI Allele Allele Type Availability
Sgo2atm1a(EUCOMM)Wtsi KO first allele (reporter-tagged insertion with conditional potential) Mice, Targeting vectors, ES Cells
Sgo2atm1(KOMP)Vlcg Reporter-tagged deletion allele (with selection cassette) Targeting vectors, ES Cells

The IMPC Newsletter

Get highlights of the most important data releases, news and events, delivered straight to your email inbox

Subscribe to newsletter