All vision/eye phenotype data for Dbn1

Mouseover the data points for more information. Click and drag to zoom the chart. Click on the legends to disable/enable data.

Allele Center Procedure / Parameter Zygosity Mutants Statistical
Method
P Value Status
Dbn1tm1b(KOMP)Wtsi HMGU Eye Morphology / Bulging eye HET 10f:10m Fisher Exact Test framework 0.0105 Success
Dbn1tm1b(KOMP)Wtsi TCP Eye Morphology / Bulging eye HET 8f:8m Fisher Exact Test framework 1.00 Not tested (No variation) - OK
Dbn1tm1b(KOMP)Wtsi RBRC Eye Morphology / Bulging eye HET 7f:7m Fisher Exact Test framework 1.00 Not tested (No variation) - OK
Dbn1tm1b(KOMP)Wtsi BCM Eye Morphology / Bulging eye HET 8f:5m Fisher Exact Test framework 1.00 Success
Dbn1tm1b(KOMP)Wtsi BCM Eye Morphology / Bulging eye HOM 1f:1m - 1.00 FAILED - Not enough mutant or control data
Dbn1em1(IMPC)Bay BCM Eye Morphology / Bulging eye HOM 7f:7m Fisher Exact Test framework 1.00 Success
Dbn1tm1b(KOMP)Wtsi WTSI Eye Morphology / Bulging eye HET 7f:7m Fisher Exact Test framework 1.00 Success
Dbn1tm1b(KOMP)Wtsi KMPC Eye Morphology / Bulging eye HET 8f:7m Fisher Exact Test framework 1.00 Not tested (No variation) - OK
Dbn1tm1a(KOMP)Wtsi WTSI Eye Morphology / Bulging eye HET 7f:7m Fisher Exact Test framework 1.00 Success
Dbn1tm1a(KOMP)Wtsi WTSI Eye Morphology / Bulging eye HOM 3f:1m - 1.00 FAILED - Not enough mutant or control data
Dbn1tm1b(KOMP)Wtsi JAX Eye Morphology / Bulging eye HET 7f:9m Fisher Exact Test framework 1.00 Success
Dbn1tm1b(KOMP)Wtsi ICS Eye Morphology / Bulging eye HET 8f:8m Fisher Exact Test framework 1.00 Success
Dbn1tm1b(KOMP)Wtsi BCM Eye Morphology / Left posterior chamber depth HOM 1f:1m Not processed 1.00 FAILED - Not enough mutant or control data
Dbn1tm1a(KOMP)Wtsi WTSI Eye Morphology / Left posterior chamber depth HOM 3f:1m Not processed 1.00 FAILED - Not enough mutant or control data
Dbn1tm1b(KOMP)Wtsi ICS Eye Morphology / Left vitreous humour thickness HET 7f:8m Mixed Model framework, generalized least squares, equation withoutWeight 0.133 Success
Dbn1tm1b(KOMP)Wtsi BCM Eye Morphology / Left vitreous humour thickness HOM 1f:1m Not processed 1.00 FAILED - Not enough mutant or control data
Dbn1tm1a(KOMP)Wtsi WTSI Eye Morphology / Left vitreous humour thickness HOM 3f:1m Not processed 1.00 FAILED - Not enough mutant or control data
Dbn1em1(IMPC)Bay BCM Eye Morphology / Iris/Pupil HOM 7f:7m Fisher Exact Test framework 0.0852 Success
Dbn1tm1b(KOMP)Wtsi TCP Eye Morphology / Iris/Pupil HET 8f:8m Fisher Exact Test framework 1.00 Success
Dbn1tm1b(KOMP)Wtsi HMGU Eye Morphology / Iris/Pupil HET 10f:10m Fisher Exact Test framework 1.00 Success
Dbn1tm1b(KOMP)Wtsi BCM Eye Morphology / Iris/Pupil HET 8f:5m Fisher Exact Test framework 1.00 Success
Dbn1tm1b(KOMP)Wtsi BCM Eye Morphology / Iris/Pupil HOM 1f:1m - 1.00 FAILED - Not enough mutant or control data
Dbn1tm1b(KOMP)Wtsi WTSI Eye Morphology / Iris/Pupil HET 7f:7m Fisher Exact Test framework 1.00 Success
Dbn1tm1b(KOMP)Wtsi KMPC Eye Morphology / Iris/Pupil HET 8f:7m Fisher Exact Test framework 1.00 Not tested (No variation) - OK
Dbn1tm1a(KOMP)Wtsi WTSI Eye Morphology / Iris/Pupil HET 7f:7m Fisher Exact Test framework 1.00 Success
Dbn1tm1a(KOMP)Wtsi WTSI Eye Morphology / Iris/Pupil HOM 3f:1m - 1.00 FAILED - Not enough mutant or control data
Dbn1tm1b(KOMP)Wtsi JAX Eye Morphology / Iris/Pupil HET 7f:9m Fisher Exact Test framework 1.00 Success
Dbn1tm1b(KOMP)Wtsi RBRC Eye Morphology / Iris/Pupil HET 7f:7m Fisher Exact Test framework 1.00 Success
Dbn1tm1b(KOMP)Wtsi ICS Eye Morphology / Iris/Pupil HET 8f:8m Fisher Exact Test framework 1.00 Success
Dbn1tm1a(KOMP)Wtsi WTSI Dysmorphology / Eye colouration HET 4f:5m Fisher Exact Test framework 0.0970 Success
Dbn1tm1a(KOMP)Wtsi WTSI Dysmorphology / Eye colouration HET 4f:5m Fisher Exact Test framework 0.0970 Success
Dbn1tm1a(KOMP)Wtsi WTSI Dysmorphology / Eye colouration HOM 4f:4m Fisher Exact Test framework 1.00 Success
Dbn1tm1a(KOMP)Wtsi WTSI Dysmorphology / Eye colouration HOM 4f:4m Fisher Exact Test framework 1.00 Success
Dbn1tm1a(KOMP)Wtsi WTSI Dysmorphology / Eye size HET 4f:5m Fisher Exact Test framework 0.157 Success
Dbn1tm1a(KOMP)Wtsi WTSI Dysmorphology / Eye size HET 4f:5m Fisher Exact Test framework 0.157 Success
Dbn1tm1a(KOMP)Wtsi WTSI Dysmorphology / Eye size HOM 4f:4m Fisher Exact Test framework 1.00 Success
Dbn1tm1a(KOMP)Wtsi WTSI Dysmorphology / Eye size HOM 4f:4m Fisher Exact Test framework 1.00 Success
Dbn1tm1b(KOMP)Wtsi HMGU Eye Morphology / Max left eye lens density HET 10f:10m Mixed Model framework, linear mixed-effects model, equation withWeight 0.209 Success
Dbn1tm1b(KOMP)Wtsi BCM Eye Morphology / Max left eye lens density HOM 1f:1m Not processed 1.00 FAILED - Not enough mutant or control data
Dbn1tm1a(KOMP)Wtsi WTSI Eye Morphology / Max left eye lens density HOM 3f:1m Not processed 1.00 FAILED - Not enough mutant or control data
Dbn1tm1a(KOMP)Wtsi WTSI Dysmorphology / Eyes HET 4f:5m Fisher Exact Test framework 1.00 Not tested (No variation) - OK
Dbn1tm1a(KOMP)Wtsi WTSI Dysmorphology / Eyes HOM 4f:4m Fisher Exact Test framework 1.00 Not tested (No variation) - OK
Dbn1tm1a(KOMP)Wtsi WTSI Dysmorphology / Eyes HOM 4f:4m Fisher Exact Test framework 1.00 Not tested (No variation) - OK
Dbn1tm1a(KOMP)Wtsi WTSI Dysmorphology / Eyes HET 4f:5m Fisher Exact Test framework 1.00 Not tested (No variation) - OK
Dbn1tm1a(KOMP)Wtsi WTSI Combined SHIRPA and Dysmorphology / Eyelid Opening HOM 3f:1m - 1.00 FAILED - Not enough mutant or control data
Dbn1em1(IMPC)Bay BCM Eye Morphology / Synechia HOM 7f:7m Fisher Exact Test framework 0.180 Success
Dbn1tm1b(KOMP)Wtsi TCP Eye Morphology / Synechia HET 8f:8m Fisher Exact Test framework 1.00 Not tested (No variation) - OK
Dbn1tm1b(KOMP)Wtsi HMGU Eye Morphology / Synechia HET 10f:10m Fisher Exact Test framework 1.00 Not tested (No variation) - OK
Dbn1tm1a(KOMP)Wtsi WTSI Eye Morphology / Synechia HOM 3f:1m - 1.00 FAILED - Not enough mutant or control data
Dbn1tm1b(KOMP)Wtsi BCM Eye Morphology / Synechia HOM 1f:1m - 1.00 FAILED - Not enough mutant or control data
Dbn1tm1b(KOMP)Wtsi KMPC Eye Morphology / Synechia HET 8f:7m Fisher Exact Test framework 1.00 Not tested (No variation) - OK
Dbn1tm1b(KOMP)Wtsi BCM Eye Morphology / Synechia HET 8f:5m Fisher Exact Test framework 1.00 Success
Dbn1tm1b(KOMP)Wtsi WTSI Eye Morphology / Synechia HET 7f:7m Fisher Exact Test framework 1.00 Success
Dbn1tm1b(KOMP)Wtsi JAX Eye Morphology / Synechia HET 7f:9m Fisher Exact Test framework 1.00 Success
Dbn1tm1a(KOMP)Wtsi WTSI Eye Morphology / Synechia HET 7f:7m Fisher Exact Test framework 1.00 Success
Dbn1tm1b(KOMP)Wtsi RBRC Eye Morphology / Synechia HET 7f:7m Fisher Exact Test framework 1.00 Success
Dbn1tm1b(KOMP)Wtsi ICS Eye Morphology / Synechia HET 8f:8m Fisher Exact Test framework 1.00 Success
Dbn1tm1b(KOMP)Wtsi ICS Eye Morphology / Right inner nuclear layer HET 8f:8m Mixed Model framework, linear mixed-effects model, equation withoutWeight 0.448 Success
Dbn1tm1b(KOMP)Wtsi BCM Eye Morphology / Right inner nuclear layer HOM 1f:1m Not processed 1.00 FAILED - Not enough mutant or control data
Dbn1tm1a(KOMP)Wtsi WTSI Eye Morphology / Right inner nuclear layer HOM 3f:1m Not processed 1.00 FAILED - Not enough mutant or control data
Dbn1tm1b(KOMP)Wtsi JAX Gross Morphology Embryo E18.5 / Microphthalmia HOM f:m Supplied as data Success
Dbn1tm1b(KOMP)Wtsi JAX Gross Morphology Embryo E18.5 / Microphthalmia HOM f:m Supplied as data Success
Dbn1tm1b(KOMP)Wtsi JAX Gross Morphology Embryo E18.5 / Microphthalmia HET f:m Supplied as data Success
Dbn1tm1b(KOMP)Wtsi JAX Gross Morphology Embryo E18.5 / Microphthalmia HET f:m Supplied as data Success
Dbn1tm1b(KOMP)Wtsi BCM Gross Morphology Embryo E18.5 / Microphthalmia HOM f:m Supplied as data Success
Dbn1tm1b(KOMP)Wtsi BCM Gross Morphology Embryo E18.5 / Microphthalmia HOM f:m Supplied as data Success
Dbn1tm1b(KOMP)Wtsi BCM Gross Morphology Embryo E18.5 / Microphthalmia HET f:m Supplied as data Success
Dbn1tm1b(KOMP)Wtsi BCM Gross Morphology Embryo E18.5 / Microphthalmia HET f:m Supplied as data Success
Dbn1tm1b(KOMP)Wtsi HMGU Eye Morphology / Corneal deposits HET 10f:10m Fisher Exact Test framework 1.00 Not tested (No variation) - OK
Dbn1tm1b(KOMP)Wtsi BCM Eye Morphology / Corneal deposits HOM 1f:1m - 1.00 FAILED - Not enough mutant or control data
Dbn1tm1a(KOMP)Wtsi WTSI Eye Morphology / Corneal deposits HOM 3f:1m - 1.00 FAILED - Not enough mutant or control data
Dbn1tm1b(KOMP)Wtsi JAX Eye Morphology / Corneal deposits HET 7f:9m Fisher Exact Test framework 1.00 Success
Dbn1tm1b(KOMP)Wtsi RBRC Eye Morphology / Corneal deposits HET 7f:7m Fisher Exact Test framework 1.00 Not tested (No variation) - OK
Dbn1tm1b(KOMP)Wtsi ICS Eye Morphology / Corneal deposits HET 8f:8m Fisher Exact Test framework 1.00 Success
Dbn1tm1b(KOMP)Wtsi UC Davis Gross Morphology Embryo E12.5 / Eye Morphology HET f:m Supplied as data Success
Dbn1tm1b(KOMP)Wtsi UC Davis Gross Morphology Embryo E12.5 / Eye Morphology HOM f:m Supplied as data Success
Dbn1em2(IMPC)Mbp UC Davis Gross Morphology Embryo E12.5 / Eye Morphology HET f:m Supplied as data Success
Dbn1em2(IMPC)Mbp UC Davis Gross Morphology Embryo E12.5 / Eye Morphology HOM f:m Supplied as data Success
Dbn1tm1b(KOMP)Wtsi UC Davis Gross Morphology Embryo E12.5 / Eye Morphology HET f:m Supplied as data Success
Dbn1tm1b(KOMP)Wtsi UC Davis Gross Morphology Embryo E12.5 / Eye Morphology HOM f:m Supplied as data Success
Dbn1em2(IMPC)Mbp UC Davis Gross Morphology Embryo E12.5 / Eye Morphology HET f:m Supplied as data Success
Dbn1em2(IMPC)Mbp UC Davis Gross Morphology Embryo E12.5 / Eye Morphology HOM f:m Supplied as data Success
Dbn1tm1b(KOMP)Wtsi BCM Gross Morphology Embryo E12.5 / Eye Morphology HET f:m Supplied as data Success
Dbn1tm1b(KOMP)Wtsi TCP Gross Morphology Embryo E12.5 / Eye Morphology HOM f:m Supplied as data Success
Dbn1tm1b(KOMP)Wtsi TCP Gross Morphology Embryo E12.5 / Eye Morphology HET f:m Supplied as data Success
Dbn1tm1b(KOMP)Wtsi BCM Gross Morphology Embryo E12.5 / Eye Morphology HET f:m Supplied as data Success
Dbn1tm1b(KOMP)Wtsi BCM Gross Morphology Embryo E12.5 / Eye Morphology HOM f:m Supplied as data Success
Dbn1tm1b(KOMP)Wtsi JAX Electroretinography / Rod b-wave amplitude-right HET 2f:1m Not processed 1.00 FAILED - Not enough mutant or control data
Dbn1tm1b(KOMP)Wtsi ICS Eye Morphology / Lens Opacity HET 7f:8m Fisher Exact Test framework 0.0203 Success
Dbn1tm1b(KOMP)Wtsi KMPC Eye Morphology / Lens Opacity HET 8f:7m Fisher Exact Test framework 0.0541 Success
Dbn1tm1b(KOMP)Wtsi TCP Eye Morphology / Lens Opacity HET 8f:8m Fisher Exact Test framework 0.191 Success
Dbn1em1(IMPC)Bay BCM Eye Morphology / Lens Opacity HOM 7f:7m Fisher Exact Test framework 0.695 Success
Dbn1tm1b(KOMP)Wtsi HMGU Eye Morphology / Lens Opacity HET 10f:10m Fisher Exact Test framework 1.00 Success
Dbn1tm1b(KOMP)Wtsi BCM Eye Morphology / Lens Opacity HET 8f:5m Fisher Exact Test framework 1.00 Success
Dbn1tm1b(KOMP)Wtsi BCM Eye Morphology / Lens Opacity HOM 1f:1m - 1.00 FAILED - Not enough mutant or control data
Dbn1tm1b(KOMP)Wtsi WTSI Eye Morphology / Lens Opacity HET 7f:7m Fisher Exact Test framework 1.00 Success
Dbn1tm1b(KOMP)Wtsi JAX Eye Morphology / Lens Opacity HET 7f:9m Fisher Exact Test framework 1.00 Success
Dbn1tm1a(KOMP)Wtsi WTSI Eye Morphology / Lens Opacity HOM 3f:1m - 1.00 FAILED - Not enough mutant or control data
Dbn1tm1a(KOMP)Wtsi WTSI Eye Morphology / Lens Opacity HET 7f:7m Fisher Exact Test framework 1.00 Success
Dbn1tm1b(KOMP)Wtsi RBRC Eye Morphology / Lens Opacity HET 7f:7m Fisher Exact Test framework 1.00 Success
Dbn1tm1b(KOMP)Wtsi UC Davis Gross Morphology Embryo E12.5 / Microphthalmia HET f:m Supplied as data Success
Dbn1tm1b(KOMP)Wtsi UC Davis Gross Morphology Embryo E12.5 / Microphthalmia HET f:m Supplied as data Success
Dbn1tm1b(KOMP)Wtsi UC Davis Gross Morphology Embryo E12.5 / Microphthalmia HOM f:m Supplied as data Success
Dbn1em2(IMPC)Mbp UC Davis Gross Morphology Embryo E12.5 / Microphthalmia HOM f:m Supplied as data Success
Dbn1tm1b(KOMP)Wtsi UC Davis Gross Morphology Embryo E12.5 / Microphthalmia HOM f:m Supplied as data Success
Dbn1em2(IMPC)Mbp UC Davis Gross Morphology Embryo E12.5 / Microphthalmia HET f:m Supplied as data Success
Dbn1em2(IMPC)Mbp UC Davis Gross Morphology Embryo E12.5 / Microphthalmia HET f:m Supplied as data Success
Dbn1em2(IMPC)Mbp UC Davis Gross Morphology Embryo E12.5 / Microphthalmia HOM f:m Supplied as data Success
Dbn1tm1b(KOMP)Wtsi BCM Gross Morphology Embryo E12.5 / Microphthalmia HOM f:m Supplied as data Success
Dbn1tm1b(KOMP)Wtsi BCM Gross Morphology Embryo E12.5 / Microphthalmia HET f:m Supplied as data Success
Dbn1tm1b(KOMP)Wtsi BCM Gross Morphology Embryo E12.5 / Microphthalmia HET f:m Supplied as data Success
Dbn1tm1b(KOMP)Wtsi TCP Eye Morphology / Eyelid morphology HET 8f:8m Fisher Exact Test framework 1.00 Success
Dbn1tm1b(KOMP)Wtsi HMGU Eye Morphology / Eyelid morphology HET 10f:10m Fisher Exact Test framework 1.00 Success
Dbn1tm1b(KOMP)Wtsi RBRC Eye Morphology / Eyelid morphology HET 7f:7m Fisher Exact Test framework 1.00 Not tested (No variation) - OK
Dbn1tm1b(KOMP)Wtsi BCM Eye Morphology / Eyelid morphology HET 8f:5m Fisher Exact Test framework 1.00 Success
Dbn1tm1b(KOMP)Wtsi BCM Eye Morphology / Eyelid morphology HOM 1f:1m - 1.00 FAILED - Not enough mutant or control data
Dbn1tm1b(KOMP)Wtsi WTSI Eye Morphology / Eyelid morphology HET 7f:7m Fisher Exact Test framework 1.00 Success
Dbn1em1(IMPC)Bay BCM Eye Morphology / Eyelid morphology HOM 7f:7m Fisher Exact Test framework 1.00 Not tested (No variation) - OK
Dbn1tm1b(KOMP)Wtsi KMPC Eye Morphology / Eyelid morphology HET 8f:7m Fisher Exact Test framework 1.00 Not tested (No variation) - OK
Dbn1tm1a(KOMP)Wtsi WTSI Eye Morphology / Eyelid morphology HET 7f:7m Fisher Exact Test framework 1.00 Success
Dbn1tm1a(KOMP)Wtsi WTSI Eye Morphology / Eyelid morphology HOM 3f:1m - 1.00 FAILED - Not enough mutant or control data
Dbn1tm1b(KOMP)Wtsi JAX Eye Morphology / Eyelid morphology HET 7f:9m Fisher Exact Test framework 1.00 Success
Dbn1tm1b(KOMP)Wtsi ICS Eye Morphology / Eyelid morphology HET 8f:8m Fisher Exact Test framework 1.00 Not tested (No variation) - OK
Dbn1tm1b(KOMP)Wtsi BCM Eye Morphology / Right posterior chamber depth HOM 1f:1m Not processed 1.00 FAILED - Not enough mutant or control data
Dbn1tm1a(KOMP)Wtsi WTSI Eye Morphology / Right posterior chamber depth HOM 3f:1m Not processed 1.00 FAILED - Not enough mutant or control data
Dbn1tm1b(KOMP)Wtsi JAX Gross Morphology Embryo E18.5 / Anophthalmia HOM f:m Supplied as data Success
Dbn1tm1b(KOMP)Wtsi JAX Gross Morphology Embryo E18.5 / Anophthalmia HOM f:m Supplied as data Success
Dbn1tm1b(KOMP)Wtsi JAX Gross Morphology Embryo E18.5 / Anophthalmia HET f:m Supplied as data Success
Dbn1tm1b(KOMP)Wtsi JAX Gross Morphology Embryo E18.5 / Anophthalmia HET f:m Supplied as data Success
Dbn1tm1b(KOMP)Wtsi BCM Gross Morphology Embryo E18.5 / Anophthalmia HET f:m Supplied as data Success
Dbn1tm1b(KOMP)Wtsi BCM Gross Morphology Embryo E18.5 / Anophthalmia HET f:m Supplied as data Success
Dbn1tm1b(KOMP)Wtsi BCM Gross Morphology Embryo E18.5 / Anophthalmia HOM f:m Supplied as data Success
Dbn1tm1b(KOMP)Wtsi BCM Gross Morphology Embryo E18.5 / Anophthalmia HOM f:m Supplied as data Success
Dbn1tm1b(KOMP)Wtsi BCM Eye Morphology / Cornea HET 8f:5m Fisher Exact Test framework 0.374 Success
Dbn1tm1a(KOMP)Wtsi WTSI Eye Morphology / Cornea HET 7f:7m Fisher Exact Test framework 0.654 Success
Dbn1em1(IMPC)Bay BCM Eye Morphology / Cornea HOM 7f:7m Fisher Exact Test framework 0.689 Success
Dbn1tm1b(KOMP)Wtsi ICS Eye Morphology / Cornea HET 8f:8m Fisher Exact Test framework 0.886 Success
Dbn1tm1b(KOMP)Wtsi TCP Eye Morphology / Cornea HET 8f:8m Fisher Exact Test framework 1.00 Success
Dbn1tm1b(KOMP)Wtsi HMGU Eye Morphology / Cornea HET 10f:10m Fisher Exact Test framework 1.00 Success
Dbn1tm1b(KOMP)Wtsi RBRC Eye Morphology / Cornea HET 7f:7m Fisher Exact Test framework 1.00 Success
Dbn1tm1b(KOMP)Wtsi WTSI Eye Morphology / Cornea HET 7f:7m Fisher Exact Test framework 1.00 Success
Dbn1tm1b(KOMP)Wtsi BCM Eye Morphology / Cornea HOM 1f:1m - 1.00 FAILED - Not enough mutant or control data
Dbn1tm1b(KOMP)Wtsi KMPC Eye Morphology / Cornea HET 8f:7m Fisher Exact Test framework 1.00 Success
Dbn1tm1a(KOMP)Wtsi WTSI Eye Morphology / Cornea HOM 3f:1m - 1.00 FAILED - Not enough mutant or control data
Dbn1tm1b(KOMP)Wtsi JAX Eye Morphology / Cornea HET 7f:9m Fisher Exact Test framework 1.00 Success
Dbn1tm1b(KOMP)Wtsi TCP Eye Morphology / Retina (combined) HET 8f:8m Not processed Success
Dbn1tm1b(KOMP)Wtsi HMGU Eye Morphology / Retina (combined) HET 10f:10m Not processed Success
Dbn1tm1b(KOMP)Wtsi BCM Eye Morphology / Retina (combined) HET 8f:5m Not processed Success
Dbn1tm1b(KOMP)Wtsi WTSI Eye Morphology / Retina (combined) HET 7f:7m Not processed Success
Dbn1em1(IMPC)Bay BCM Eye Morphology / Retina (combined) HOM 7f:7m Not processed Success
Dbn1tm1b(KOMP)Wtsi KMPC Eye Morphology / Retina (combined) HET 8f:7m Not processed Success
Dbn1tm1b(KOMP)Wtsi JAX Eye Morphology / Retina (combined) HET 7f:9m Not processed Success
Dbn1tm1a(KOMP)Wtsi WTSI Eye Morphology / Retina (combined) HET 7f:7m Not processed Success
Dbn1tm1b(KOMP)Wtsi RBRC Eye Morphology / Retina (combined) HET 7f:7m Not processed Success
Dbn1tm1b(KOMP)Wtsi ICS Eye Morphology / Retina (combined) HET 8f:8m Not processed Success
Dbn1tm1b(KOMP)Wtsi BCM Eye Morphology / Retina (combined) HOM 1f:1m Not processed 1.00 FAILED - Not enough mutant or control data
Dbn1tm1a(KOMP)Wtsi WTSI Eye Morphology / Retina (combined) HOM 3f:1m Not processed 1.00 FAILED - Not enough mutant or control data
Dbn1tm1b(KOMP)Wtsi BCM Eye Morphology / Left anterior chamber depth HOM 1f:1m Not processed 1.00 FAILED - Not enough mutant or control data
Dbn1tm1a(KOMP)Wtsi WTSI Eye Morphology / Left anterior chamber depth HOM 3f:1m Not processed 1.00 FAILED - Not enough mutant or control data
Dbn1tm1b(KOMP)Wtsi ICS Eye Morphology / Left anterior chamber depth HET 3f:8m Not processed 1.00 FAILED - Not enough data points in dependent variable 'IMPC_EYE_067_001' for genotype/sex combinations to allow the application of MM/TF framework. Threshold used: 4.
Dbn1tm1a(KOMP)Wtsi WTSI Eye Morphology / Corneal mineralization HOM 3f:1m - 1.00 FAILED - Not enough mutant or control data
Dbn1tm1b(KOMP)Wtsi BCM Eye Morphology / Corneal mineralization HOM 1f:1m - 1.00 FAILED - Not enough mutant or control data
Dbn1tm1b(KOMP)Wtsi KMPC Eye Morphology / Corneal mineralization HET 8f:7m Fisher Exact Test framework 1.00 Not tested (No variation) - OK
Dbn1tm1b(KOMP)Wtsi RBRC Eye Morphology / Corneal mineralization HET 7f:7m Fisher Exact Test framework 1.00 Not tested (No variation) - OK
Dbn1tm1b(KOMP)Wtsi ICS Eye Morphology / Corneal mineralization HET 8f:8m Fisher Exact Test framework 1.00 Success
Dbn1tm1b(KOMP)Wtsi HMGU Eye Morphology / Max right eye lens density HET 9f:10m Mixed Model framework, linear mixed-effects model, equation withWeight 0.00817 Success
Dbn1tm1b(KOMP)Wtsi BCM Eye Morphology / Max right eye lens density HOM 1f:1m Not processed 1.00 FAILED - Not enough mutant or control data
Dbn1tm1a(KOMP)Wtsi WTSI Eye Morphology / Max right eye lens density HOM 3f:1m Not processed 1.00 FAILED - Not enough mutant or control data
Dbn1tm1a(KOMP)Wtsi WTSI X-ray / Orbit HOM 5f:4m Fisher Exact Test framework 1.00 Not tested (No variation) - OK
Dbn1tm1a(KOMP)Wtsi WTSI X-ray / Orbit HET 6f:8m Fisher Exact Test framework 1.00 Not tested (No variation) - OK
Dbn1tm1a(KOMP)Wtsi WTSI X-ray / Orbit HET 6f:8m Fisher Exact Test framework 1.00 Not tested (No variation) - OK
Dbn1tm1a(KOMP)Wtsi WTSI X-ray / Orbit HOM 5f:4m Fisher Exact Test framework 1.00 Not tested (No variation) - OK
Dbn1tm1b(KOMP)Wtsi TCP Eye Morphology / Iris Pigmentation HET 8f:8m Fisher Exact Test framework 1.00 Not tested (No variation) - OK
Dbn1tm1b(KOMP)Wtsi HMGU Eye Morphology / Iris Pigmentation HET 10f:10m Fisher Exact Test framework 1.00 Not tested (No variation) - OK
Dbn1tm1a(KOMP)Wtsi WTSI Eye Morphology / Iris Pigmentation HOM 3f:1m - 1.00 FAILED - Not enough mutant or control data
Dbn1tm1b(KOMP)Wtsi BCM Eye Morphology / Iris Pigmentation HET 8f:5m Fisher Exact Test framework 1.00 Not tested (No variation) - OK
Dbn1tm1b(KOMP)Wtsi WTSI Eye Morphology / Iris Pigmentation HET 7f:7m Fisher Exact Test framework 1.00 Success
Dbn1tm1b(KOMP)Wtsi BCM Eye Morphology / Iris Pigmentation HOM 1f:1m - 1.00 FAILED - Not enough mutant or control data
Dbn1em1(IMPC)Bay BCM Eye Morphology / Iris Pigmentation HOM 7f:7m Fisher Exact Test framework 1.00 Success
Dbn1tm1b(KOMP)Wtsi KMPC Eye Morphology / Iris Pigmentation HET 8f:7m Fisher Exact Test framework 1.00 Not tested (No variation) - OK
Dbn1tm1a(KOMP)Wtsi WTSI Eye Morphology / Iris Pigmentation HET 7f:7m Fisher Exact Test framework 1.00 Success
Dbn1tm1b(KOMP)Wtsi JAX Eye Morphology / Iris Pigmentation HET 7f:9m Fisher Exact Test framework 1.00 Success
Dbn1tm1b(KOMP)Wtsi RBRC Eye Morphology / Iris Pigmentation HET 7f:7m Fisher Exact Test framework 1.00 Not tested (No variation) - OK
Dbn1tm1b(KOMP)Wtsi ICS Eye Morphology / Iris Pigmentation HET 8f:8m Fisher Exact Test framework 1.00 Success
Dbn1tm1b(KOMP)Wtsi KMPC Eye Morphology / Retinal Blood Vessels HET 8f:7m Fisher Exact Test framework 0.0399 Success
Dbn1tm1b(KOMP)Wtsi HMGU Eye Morphology / Retinal Blood Vessels HET 10f:10m Fisher Exact Test framework 0.331 Success
Dbn1em1(IMPC)Bay BCM Eye Morphology / Retinal Blood Vessels HOM 7f:7m Fisher Exact Test framework 0.888 Success
Dbn1tm1b(KOMP)Wtsi BCM Eye Morphology / Retinal Blood Vessels HET 8f:5m Fisher Exact Test framework 0.912 Success
Dbn1tm1b(KOMP)Wtsi TCP Eye Morphology / Retinal Blood Vessels HET 8f:8m Fisher Exact Test framework 1.00 Not tested (No variation) - OK
Dbn1tm1b(KOMP)Wtsi BCM Eye Morphology / Retinal Blood Vessels HOM 1f:1m - 1.00 FAILED - Not enough mutant or control data
Dbn1tm1b(KOMP)Wtsi WTSI Eye Morphology / Retinal Blood Vessels HET 7f:7m Fisher Exact Test framework 1.00 Success
Dbn1tm1b(KOMP)Wtsi JAX Eye Morphology / Retinal Blood Vessels HET 7f:9m Fisher Exact Test framework 1.00 Success
Dbn1tm1a(KOMP)Wtsi WTSI Eye Morphology / Retinal Blood Vessels HET 7f:7m Fisher Exact Test framework 1.00 Success
Dbn1tm1a(KOMP)Wtsi WTSI Eye Morphology / Retinal Blood Vessels HOM 3f:1m - 1.00 FAILED - Not enough mutant or control data
Dbn1tm1b(KOMP)Wtsi RBRC Eye Morphology / Retinal Blood Vessels HET 7f:7m Fisher Exact Test framework 1.00 Not tested (No variation) - OK
Dbn1tm1b(KOMP)Wtsi ICS Eye Morphology / Retinal Blood Vessels HET 8f:8m Fisher Exact Test framework 1.00 Success
Dbn1tm1b(KOMP)Wtsi TCP Eye Morphology / Pupil Dilation HET 8f:8m Fisher Exact Test framework 1.00 Success
Dbn1tm1b(KOMP)Wtsi HMGU Eye Morphology / Pupil Dilation HET 10f:10m Fisher Exact Test framework 1.00 Success
Dbn1tm1b(KOMP)Wtsi RBRC Eye Morphology / Pupil Dilation HET 7f:7m Fisher Exact Test framework 1.00 Not tested (No variation) - OK
Dbn1tm1b(KOMP)Wtsi BCM Eye Morphology / Pupil Dilation HET 8f:5m Fisher Exact Test framework 1.00 Not tested (No variation) - OK
Dbn1tm1b(KOMP)Wtsi BCM Eye Morphology / Pupil Dilation HOM 1f:1m - 1.00 FAILED - Not enough mutant or control data
Dbn1tm1b(KOMP)Wtsi WTSI Eye Morphology / Pupil Dilation HET 7f:7m Fisher Exact Test framework 1.00 Success
Dbn1em1(IMPC)Bay BCM Eye Morphology / Pupil Dilation HOM 7f:7m Fisher Exact Test framework 1.00 Not tested (No variation) - OK
Dbn1tm1b(KOMP)Wtsi KMPC Eye Morphology / Pupil Dilation HET 8f:7m Fisher Exact Test framework 1.00 Not tested (No variation) - OK
Dbn1tm1a(KOMP)Wtsi WTSI Eye Morphology / Pupil Dilation HOM 3f:1m - 1.00 FAILED - Not enough mutant or control data
Dbn1tm1a(KOMP)Wtsi WTSI Eye Morphology / Pupil Dilation HET 7f:7m Fisher Exact Test framework 1.00 Success
Dbn1tm1b(KOMP)Wtsi JAX Eye Morphology / Pupil Dilation HET 7f:9m Fisher Exact Test framework 1.00 Success
Dbn1tm1b(KOMP)Wtsi ICS Eye Morphology / Pupil Dilation HET 8f:8m Fisher Exact Test framework 1.00 Success
Dbn1tm1b(KOMP)Wtsi BCM Eye Morphology / Lacrimation HOM 1f:1m - 1.00 FAILED - Not enough mutant or control data
Dbn1tm1b(KOMP)Wtsi KMPC Eye Morphology / Lacrimation HET 8f:7m Fisher Exact Test framework 1.00 Not tested (No variation) - OK
Dbn1tm1a(KOMP)Wtsi WTSI Eye Morphology / Lacrimation HOM 3f:1m - 1.00 FAILED - Not enough mutant or control data
Dbn1tm1b(KOMP)Wtsi RBRC Eye Morphology / Lacrimation HET 7f:7m Fisher Exact Test framework 1.00 Not tested (No variation) - OK
Dbn1tm1b(KOMP)Wtsi ICS Eye Morphology / Lacrimation HET 8f:8m Fisher Exact Test framework 1.00 Success
Dbn1tm1b(KOMP)Wtsi HMGU Eye Morphology / Mean left eye lens density HET 10f:10m Mixed Model framework, linear mixed-effects model, equation withWeight 0.951 Success
Dbn1tm1b(KOMP)Wtsi BCM Eye Morphology / Mean left eye lens density HOM 1f:1m Not processed 1.00 FAILED - Not enough mutant or control data
Dbn1tm1a(KOMP)Wtsi WTSI Eye Morphology / Mean left eye lens density HOM 3f:1m Not processed 1.00 FAILED - Not enough mutant or control data
Dbn1tm1b(KOMP)Wtsi ICS Eye Morphology / Left inner nuclear layer HET 7f:8m Mixed Model framework, generalized least squares, equation withoutWeight 1.72×10-06 Success
Dbn1tm1b(KOMP)Wtsi BCM Eye Morphology / Left inner nuclear layer HOM 1f:1m Not processed 1.00 FAILED - Not enough mutant or control data
Dbn1tm1a(KOMP)Wtsi WTSI Eye Morphology / Left inner nuclear layer HOM 3f:1m Not processed 1.00 FAILED - Not enough mutant or control data
Dbn1tm1a(KOMP)Wtsi WTSI Combined SHIRPA and Dysmorphology / Eye Morphology HOM 3f:1m - 1.00 FAILED - Not enough mutant or control data
Dbn1tm1b(KOMP)Wtsi ICS Eye Morphology / Right corneal thickness HET 6f:5m Mixed Model framework, linear mixed-effects model, equation withoutWeight 0.246 Success
Dbn1tm1b(KOMP)Wtsi BCM Eye Morphology / Right corneal thickness HOM 1f:1m Not processed 1.00 FAILED - Not enough mutant or control data
Dbn1tm1a(KOMP)Wtsi WTSI Eye Morphology / Right corneal thickness HOM 3f:1m Not processed 1.00 FAILED - Not enough mutant or control data
Dbn1tm1b(KOMP)Wtsi UC Davis Gross Morphology Embryo E14.5-E15.5 / Microphthalmia HOM f:m Supplied as data Success
Dbn1tm1b(KOMP)Wtsi UC Davis Gross Morphology Embryo E14.5-E15.5 / Microphthalmia HOM f:m Supplied as data Success
Dbn1tm1b(KOMP)Wtsi UC Davis Gross Morphology Embryo E14.5-E15.5 / Microphthalmia HET f:m Supplied as data Success
Dbn1tm1b(KOMP)Wtsi UC Davis Gross Morphology Embryo E14.5-E15.5 / Microphthalmia HET f:m Supplied as data Success
Dbn1tm1b(KOMP)Wtsi JAX Electroretinography / Rod a-wave amplitude-right HET 2f:1m Not processed 1.00 FAILED - Not enough mutant or control data
Dbn1tm1b(KOMP)Wtsi JAX Electroretinography / Rod b-wave amplitude HET 2f:1m Not processed 1.00 FAILED - Not enough mutant or control data
Dbn1tm1b(KOMP)Wtsi TCP Eye Morphology / Corneal vascularization HET 8f:8m Fisher Exact Test framework 1.00 Success
Dbn1tm1b(KOMP)Wtsi HMGU Eye Morphology / Corneal vascularization HET 10f:10m Fisher Exact Test framework 1.00 Not tested (No variation) - OK
Dbn1tm1b(KOMP)Wtsi RBRC Eye Morphology / Corneal vascularization HET 7f:7m Fisher Exact Test framework 1.00 Not tested (No variation) - OK
Dbn1tm1b(KOMP)Wtsi BCM Eye Morphology / Corneal vascularization HET 8f:5m Fisher Exact Test framework 1.00 Not tested (No variation) - OK
Dbn1tm1b(KOMP)Wtsi BCM Eye Morphology / Corneal vascularization HOM 1f:1m - 1.00 FAILED - Not enough mutant or control data
Dbn1tm1b(KOMP)Wtsi WTSI Eye Morphology / Corneal vascularization HET 7f:7m Fisher Exact Test framework 1.00 Success
Dbn1em1(IMPC)Bay BCM Eye Morphology / Corneal vascularization HOM 7f:7m Fisher Exact Test framework 1.00 Not tested (No variation) - OK
Dbn1tm1b(KOMP)Wtsi KMPC Eye Morphology / Corneal vascularization HET 8f:7m Fisher Exact Test framework 1.00 Success
Dbn1tm1a(KOMP)Wtsi WTSI Eye Morphology / Corneal vascularization HET 7f:7m Fisher Exact Test framework 1.00 Success
Dbn1tm1a(KOMP)Wtsi WTSI Eye Morphology / Corneal vascularization HOM 3f:1m - 1.00 FAILED - Not enough mutant or control data
Dbn1tm1b(KOMP)Wtsi JAX Eye Morphology / Corneal vascularization HET 7f:9m Fisher Exact Test framework 1.00 Success
Dbn1tm1b(KOMP)Wtsi ICS Eye Morphology / Corneal vascularization HET 8f:8m Fisher Exact Test framework 1.00 Success
Dbn1tm1b(KOMP)Wtsi JAX Eye Morphology / Retinal Blood Vessels Pattern HET 7f:9m Fisher Exact Test framework 0.0667 Success
Dbn1em1(IMPC)Bay BCM Eye Morphology / Retinal Blood Vessels Pattern HOM 7f:7m Fisher Exact Test framework 0.0916 Success
Dbn1tm1b(KOMP)Wtsi BCM Eye Morphology / Retinal Blood Vessels Pattern HET 8f:5m Fisher Exact Test framework 0.0961 Success
Dbn1tm1b(KOMP)Wtsi HMGU Eye Morphology / Retinal Blood Vessels Pattern HET 10f:10m Fisher Exact Test framework 0.175 Success
Dbn1tm1b(KOMP)Wtsi RBRC Eye Morphology / Retinal Blood Vessels Pattern HET 7f:7m Fisher Exact Test framework 0.282 Success
Dbn1tm1b(KOMP)Wtsi KMPC Eye Morphology / Retinal Blood Vessels Pattern HET 8f:7m Fisher Exact Test framework 0.314 Success
Dbn1tm1b(KOMP)Wtsi TCP Eye Morphology / Retinal Blood Vessels Pattern HET 8f:8m Fisher Exact Test framework 0.350 Success
Dbn1tm1a(KOMP)Wtsi WTSI Eye Morphology / Retinal Blood Vessels Pattern HOM 3f:1m - 1.00 FAILED - Not enough mutant or control data
Dbn1tm1b(KOMP)Wtsi BCM Eye Morphology / Retinal Blood Vessels Pattern HOM 1f:1m - 1.00 FAILED - Not enough mutant or control data
Dbn1tm1b(KOMP)Wtsi WTSI Eye Morphology / Retinal Blood Vessels Pattern HET 7f:7m Fisher Exact Test framework 1.00 Success
Dbn1tm1a(KOMP)Wtsi WTSI Eye Morphology / Retinal Blood Vessels Pattern HET 7f:7m Fisher Exact Test framework 1.00 Success
Dbn1tm1b(KOMP)Wtsi ICS Eye Morphology / Retinal Blood Vessels Pattern HET 8f:8m Fisher Exact Test framework 1.00 Success
Dbn1tm1b(KOMP)Wtsi UC Davis Gross Morphology Embryo E12.5 / Anophthalmia HET f:m Supplied as data Success
Dbn1tm1b(KOMP)Wtsi UC Davis Gross Morphology Embryo E12.5 / Anophthalmia HET f:m Supplied as data Success
Dbn1tm1b(KOMP)Wtsi UC Davis Gross Morphology Embryo E12.5 / Anophthalmia HOM f:m Supplied as data Success
Dbn1em2(IMPC)Mbp UC Davis Gross Morphology Embryo E12.5 / Anophthalmia HET f:m Supplied as data Success
Dbn1em2(IMPC)Mbp UC Davis Gross Morphology Embryo E12.5 / Anophthalmia HOM f:m Supplied as data Success
Dbn1em2(IMPC)Mbp UC Davis Gross Morphology Embryo E12.5 / Anophthalmia HOM f:m Supplied as data Success
Dbn1tm1b(KOMP)Wtsi UC Davis Gross Morphology Embryo E12.5 / Anophthalmia HOM f:m Supplied as data Success
Dbn1em2(IMPC)Mbp UC Davis Gross Morphology Embryo E12.5 / Anophthalmia HET f:m Supplied as data Success
Dbn1tm1b(KOMP)Wtsi BCM Gross Morphology Embryo E12.5 / Anophthalmia HET f:m Supplied as data Success
Dbn1tm1b(KOMP)Wtsi BCM Gross Morphology Embryo E12.5 / Anophthalmia HET f:m Supplied as data Success
Dbn1tm1b(KOMP)Wtsi BCM Gross Morphology Embryo E12.5 / Anophthalmia HOM f:m Supplied as data Success
Dbn1tm1b(KOMP)Wtsi ICS Eye Morphology / Right total retinal thickness HET 8f:8m Mixed Model framework, linear mixed-effects model, equation withoutWeight 0.000174 Success
Dbn1tm1b(KOMP)Wtsi HMGU Eye Morphology / Right total retinal thickness HET 9f:10m Mixed Model framework, linear mixed-effects model, equation withoutWeight 0.325 Success
Dbn1tm1b(KOMP)Wtsi BCM Eye Morphology / Right total retinal thickness HOM 1f:1m Not processed 1.00 FAILED - Not enough mutant or control data
Dbn1tm1a(KOMP)Wtsi WTSI Eye Morphology / Right total retinal thickness HOM 3f:1m Not processed 1.00 FAILED - Not enough mutant or control data
Dbn1tm1a(KOMP)Wtsi WTSI Slit Lamp / cornea vascularisation HET 7f:8m Fisher Exact Test framework 0.0706 Success
Dbn1tm1a(KOMP)Wtsi WTSI Slit Lamp / cornea vascularisation HET 7f:8m Fisher Exact Test framework 0.0706 Success
Dbn1tm1a(KOMP)Wtsi WTSI Slit Lamp / cornea vascularisation HOM 5f:4m Fisher Exact Test framework 1.00 Success
Dbn1tm1a(KOMP)Wtsi WTSI Slit Lamp / cornea vascularisation HOM 5f:4m Fisher Exact Test framework 1.00 Success
Dbn1tm1a(KOMP)Wtsi WTSI Slit Lamp / cornea opacity HOM 5f:4m Fisher Exact Test framework 0.00804 Success
Dbn1tm1a(KOMP)Wtsi WTSI Slit Lamp / cornea opacity HOM 5f:4m Fisher Exact Test framework 0.00804 Success
Dbn1tm1a(KOMP)Wtsi WTSI Slit Lamp / cornea opacity HET 7f:8m Fisher Exact Test framework 0.127 Success
Dbn1tm1a(KOMP)Wtsi WTSI Slit Lamp / cornea opacity HET 7f:8m Fisher Exact Test framework 0.127 Success
Dbn1tm1a(KOMP)Wtsi WTSI Slit Lamp / lens HOM 5f:4m Fisher Exact Test framework 0.0284 Success
Dbn1tm1a(KOMP)Wtsi WTSI Slit Lamp / lens HOM 5f:4m Fisher Exact Test framework 0.0284 Success
Dbn1tm1a(KOMP)Wtsi WTSI Slit Lamp / lens HET 7f:8m Fisher Exact Test framework 0.240 Success
Dbn1tm1a(KOMP)Wtsi WTSI Slit Lamp / lens HET 7f:8m Fisher Exact Test framework 0.240 Success
Dbn1tm1b(KOMP)Wtsi ICS Eye Morphology / Left outer nuclear layer HET 7f:8m Mixed Model framework, linear mixed-effects model, equation withoutWeight 0.806 Success
Dbn1tm1b(KOMP)Wtsi BCM Eye Morphology / Left outer nuclear layer HOM 1f:1m Not processed 1.00 FAILED - Not enough mutant or control data
Dbn1tm1a(KOMP)Wtsi WTSI Eye Morphology / Left outer nuclear layer HOM 3f:1m Not processed 1.00 FAILED - Not enough mutant or control data
Dbn1tm1a(KOMP)Wtsi WTSI Slit Lamp / Eye HOM 5f:4m Fisher Exact Test framework 0.126 Success
Dbn1tm1a(KOMP)Wtsi WTSI Slit Lamp / Eye HOM 5f:4m Fisher Exact Test framework 0.126 Success
Dbn1tm1a(KOMP)Wtsi WTSI Slit Lamp / Eye HET 7f:8m Fisher Exact Test framework 0.252 Success
Dbn1tm1a(KOMP)Wtsi WTSI Slit Lamp / Eye HET 7f:8m Fisher Exact Test framework 0.252 Success
Dbn1tm1a(KOMP)Wtsi WTSI Slit Lamp / Eye (+) blood presence HOM 5f:4m Fisher Exact Test framework 1.00 Not tested (No variation) - OK
Dbn1tm1a(KOMP)Wtsi WTSI Slit Lamp / Eye (+) blood presence HET 7f:8m Fisher Exact Test framework 1.00 Not tested (No variation) - OK
Dbn1tm1a(KOMP)Wtsi WTSI Slit Lamp / Eye (+) blood presence HET 7f:8m Fisher Exact Test framework 1.00 Not tested (No variation) - OK
Dbn1tm1a(KOMP)Wtsi WTSI Slit Lamp / Eye (+) blood presence HOM 5f:4m Fisher Exact Test framework 1.00 Not tested (No variation) - OK
Dbn1tm1a(KOMP)Wtsi WTSI Slit Lamp / Eye size HET 7f:8m Fisher Exact Test framework 1.00 Not tested (No variation) - OK
Dbn1tm1a(KOMP)Wtsi WTSI Slit Lamp / Eye size HOM 5f:4m Fisher Exact Test framework 1.00 Not tested (No variation) - OK
Dbn1tm1a(KOMP)Wtsi WTSI Slit Lamp / Eye size HOM 5f:4m Fisher Exact Test framework 1.00 Not tested (No variation) - OK
Dbn1tm1a(KOMP)Wtsi WTSI Slit Lamp / Eye size HET 7f:8m Fisher Exact Test framework 1.00 Not tested (No variation) - OK
Dbn1tm1a(KOMP)Wtsi WTSI Slit Lamp / cornea HOM 5f:4m Fisher Exact Test framework 0.0163 Success
Dbn1tm1a(KOMP)Wtsi WTSI Slit Lamp / cornea HOM 5f:4m Fisher Exact Test framework 0.0163 Success
Dbn1tm1a(KOMP)Wtsi WTSI Slit Lamp / cornea HET 7f:8m Fisher Exact Test framework 0.200 Success
Dbn1tm1a(KOMP)Wtsi WTSI Slit Lamp / cornea HET 7f:8m Fisher Exact Test framework 0.200 Success
Dbn1tm1a(KOMP)Wtsi WTSI Slit Lamp / Eyelid closure HET 7f:8m Fisher Exact Test framework 0.136 Success
Dbn1tm1a(KOMP)Wtsi WTSI Slit Lamp / Eyelid closure HET 7f:8m Fisher Exact Test framework 0.136 Success
Dbn1tm1a(KOMP)Wtsi WTSI Slit Lamp / Eyelid closure HOM 5f:4m Fisher Exact Test framework 1.00 Success
Dbn1tm1a(KOMP)Wtsi WTSI Slit Lamp / Eyelid closure HOM 5f:4m Fisher Exact Test framework 1.00 Success
Dbn1tm1b(KOMP)Wtsi HMGU Eye Morphology / Corneal Sclerization HET 10f:10m Fisher Exact Test framework 1.00 Not tested (No variation) - OK
Dbn1tm1b(KOMP)Wtsi BCM Eye Morphology / Corneal Sclerization HOM 1f:1m - 1.00 FAILED - Not enough mutant or control data
Dbn1tm1a(KOMP)Wtsi WTSI Eye Morphology / Corneal Sclerization HOM 3f:1m - 1.00 FAILED - Not enough mutant or control data
Dbn1tm1b(KOMP)Wtsi JAX Eye Morphology / Corneal Sclerization HET 7f:9m Fisher Exact Test framework 1.00 Success
Dbn1tm1b(KOMP)Wtsi RBRC Eye Morphology / Corneal Sclerization HET 7f:7m Fisher Exact Test framework 1.00 Not tested (No variation) - OK
Dbn1tm1b(KOMP)Wtsi ICS Eye Morphology / Corneal Sclerization HET 8f:8m Fisher Exact Test framework 1.00 Not tested (No variation) - OK
Dbn1tm1b(KOMP)Wtsi JAX Electroretinography / Cone b-wave amplitude HET 2f:1m Not processed 1.00 FAILED - Not enough mutant or control data
Dbn1tm1b(KOMP)Wtsi KMPC Eye Morphology / Eye Hemorrhage or Blood Presence HET 8f:7m Fisher Exact Test framework 0.0999 Success
Dbn1tm1b(KOMP)Wtsi TCP Eye Morphology / Eye Hemorrhage or Blood Presence HET 8f:8m Fisher Exact Test framework 1.00 Success
Dbn1tm1b(KOMP)Wtsi HMGU Eye Morphology / Eye Hemorrhage or Blood Presence HET 10f:10m Fisher Exact Test framework 1.00 Not tested (No variation) - OK
Dbn1tm1a(KOMP)Wtsi WTSI Eye Morphology / Eye Hemorrhage or Blood Presence HET 7f:7m Fisher Exact Test framework 1.00 Not tested (No variation) - OK
Dbn1tm1b(KOMP)Wtsi RBRC Eye Morphology / Eye Hemorrhage or Blood Presence HET 7f:7m Fisher Exact Test framework 1.00 Success
Dbn1tm1b(KOMP)Wtsi BCM Eye Morphology / Eye Hemorrhage or Blood Presence HET 8f:5m Fisher Exact Test framework 1.00 Not tested (No variation) - OK
Dbn1tm1b(KOMP)Wtsi BCM Eye Morphology / Eye Hemorrhage or Blood Presence HOM 1f:1m - 1.00 FAILED - Not enough mutant or control data
Dbn1tm1b(KOMP)Wtsi WTSI Eye Morphology / Eye Hemorrhage or Blood Presence HET 7f:7m Fisher Exact Test framework 1.00 Not tested (No variation) - OK
Dbn1em1(IMPC)Bay BCM Eye Morphology / Eye Hemorrhage or Blood Presence HOM 7f:7m Fisher Exact Test framework 1.00 Success
Dbn1tm1a(KOMP)Wtsi WTSI Eye Morphology / Eye Hemorrhage or Blood Presence HOM 3f:1m - 1.00 FAILED - Not enough mutant or control data
Dbn1tm1b(KOMP)Wtsi JAX Eye Morphology / Eye Hemorrhage or Blood Presence HET 7f:9m Fisher Exact Test framework 1.00 Success
Dbn1tm1b(KOMP)Wtsi ICS Eye Morphology / Eye Hemorrhage or Blood Presence HET 8f:8m Fisher Exact Test framework 1.00 Not tested (No variation) - OK
Dbn1tm1b(KOMP)Wtsi HMGU Eye Morphology / Min left eye lens density HET 10f:10m Mixed Model framework, linear mixed-effects model, equation withWeight 0.737 Success
Dbn1tm1b(KOMP)Wtsi BCM Eye Morphology / Min left eye lens density HOM 1f:1m Not processed 1.00 FAILED - Not enough mutant or control data
Dbn1tm1a(KOMP)Wtsi WTSI Eye Morphology / Min left eye lens density HOM 3f:1m Not processed 1.00 FAILED - Not enough mutant or control data
Dbn1tm1b(KOMP)Wtsi TCP Eye Morphology / Pupil Position HET 8f:8m Fisher Exact Test framework 1.00 Success
Dbn1tm1b(KOMP)Wtsi HMGU Eye Morphology / Pupil Position HET 10f:10m Fisher Exact Test framework 1.00 Not tested (No variation) - OK
Dbn1tm1b(KOMP)Wtsi WTSI Eye Morphology / Pupil Position HET 7f:7m Fisher Exact Test framework 1.00 Success
Dbn1tm1b(KOMP)Wtsi KMPC Eye Morphology / Pupil Position HET 8f:7m Fisher Exact Test framework 1.00 Not tested (No variation) - OK
Dbn1tm1b(KOMP)Wtsi BCM Eye Morphology / Pupil Position HET 8f:5m Fisher Exact Test framework 1.00 Success
Dbn1tm1b(KOMP)Wtsi BCM Eye Morphology / Pupil Position HOM 1f:1m - 1.00 FAILED - Not enough mutant or control data
Dbn1em1(IMPC)Bay BCM Eye Morphology / Pupil Position HOM 7f:7m Fisher Exact Test framework 1.00 Success
Dbn1tm1a(KOMP)Wtsi WTSI Eye Morphology / Pupil Position HET 7f:7m Fisher Exact Test framework 1.00 Success
Dbn1tm1a(KOMP)Wtsi WTSI Eye Morphology / Pupil Position HOM 3f:1m - 1.00 FAILED - Not enough mutant or control data
Dbn1tm1b(KOMP)Wtsi JAX Eye Morphology / Pupil Position HET 7f:9m Fisher Exact Test framework 1.00 Success
Dbn1tm1b(KOMP)Wtsi RBRC Eye Morphology / Pupil Position HET 7f:7m Fisher Exact Test framework 1.00 Success
Dbn1tm1b(KOMP)Wtsi ICS Eye Morphology / Pupil Position HET 8f:8m Fisher Exact Test framework 1.00 Success
Dbn1em1(IMPC)Bay BCM Eye Morphology / Eyelid closure HOM 7f:7m Fisher Exact Test framework 0.0248 Success
Dbn1tm1b(KOMP)Wtsi TCP Eye Morphology / Eyelid closure HET 8f:8m Fisher Exact Test framework 1.00 Success
Dbn1tm1b(KOMP)Wtsi HMGU Eye Morphology / Eyelid closure HET 10f:10m Fisher Exact Test framework 1.00 Success
Dbn1tm1b(KOMP)Wtsi RBRC Eye Morphology / Eyelid closure HET 7f:7m Fisher Exact Test framework 1.00 Not tested (No variation) - OK
Dbn1tm1b(KOMP)Wtsi BCM Eye Morphology / Eyelid closure HET 8f:5m Fisher Exact Test framework 1.00 Success
Dbn1tm1b(KOMP)Wtsi BCM Eye Morphology / Eyelid closure HOM 1f:1m - 1.00 FAILED - Not enough mutant or control data
Dbn1tm1b(KOMP)Wtsi WTSI Eye Morphology / Eyelid closure HET 7f:7m Fisher Exact Test framework 1.00 Success
Dbn1tm1b(KOMP)Wtsi KMPC Eye Morphology / Eyelid closure HET 8f:7m Fisher Exact Test framework 1.00 Success
Dbn1tm1a(KOMP)Wtsi WTSI Eye Morphology / Eyelid closure HET 7f:7m Fisher Exact Test framework 1.00 Success
Dbn1tm1a(KOMP)Wtsi WTSI Eye Morphology / Eyelid closure HOM 3f:1m - 1.00 FAILED - Not enough mutant or control data
Dbn1tm1b(KOMP)Wtsi JAX Eye Morphology / Eyelid closure HET 7f:9m Fisher Exact Test framework 1.00 Success
Dbn1tm1b(KOMP)Wtsi ICS Eye Morphology / Eyelid closure HET 8f:8m Fisher Exact Test framework 1.00 Success
Dbn1em1(IMPC)Bay BCM Eye Morphology / Fusion between cornea and lens HOM 7f:7m Fisher Exact Test framework 0.220 Success
Dbn1tm1b(KOMP)Wtsi TCP Eye Morphology / Fusion between cornea and lens HET 8f:8m Fisher Exact Test framework 1.00 Not tested (No variation) - OK
Dbn1tm1b(KOMP)Wtsi HMGU Eye Morphology / Fusion between cornea and lens HET 10f:10m Fisher Exact Test framework 1.00 Not tested (No variation) - OK
Dbn1tm1a(KOMP)Wtsi WTSI Eye Morphology / Fusion between cornea and lens HOM 3f:1m - 1.00 FAILED - Not enough mutant or control data
Dbn1tm1b(KOMP)Wtsi BCM Eye Morphology / Fusion between cornea and lens HOM 1f:1m - 1.00 FAILED - Not enough mutant or control data
Dbn1tm1b(KOMP)Wtsi KMPC Eye Morphology / Fusion between cornea and lens HET 8f:7m Fisher Exact Test framework 1.00 Success
Dbn1tm1b(KOMP)Wtsi BCM Eye Morphology / Fusion between cornea and lens HET 8f:5m Fisher Exact Test framework 1.00 Success
Dbn1tm1b(KOMP)Wtsi WTSI Eye Morphology / Fusion between cornea and lens HET 7f:7m Fisher Exact Test framework 1.00 Success
Dbn1tm1b(KOMP)Wtsi JAX Eye Morphology / Fusion between cornea and lens HET 7f:9m Fisher Exact Test framework 1.00 Success
Dbn1tm1a(KOMP)Wtsi WTSI Eye Morphology / Fusion between cornea and lens HET 7f:7m Fisher Exact Test framework 1.00 Success
Dbn1tm1b(KOMP)Wtsi RBRC Eye Morphology / Fusion between cornea and lens HET 7f:7m Fisher Exact Test framework 1.00 Not tested (No variation) - OK
Dbn1tm1b(KOMP)Wtsi ICS Eye Morphology / Fusion between cornea and lens HET 8f:8m Fisher Exact Test framework 1.00 Success
Dbn1tm1a(KOMP)Wtsi WTSI Slit Lamp / Iris/Pupil HOM 5f:4m Fisher Exact Test framework 0.182 Success
Dbn1tm1a(KOMP)Wtsi WTSI Slit Lamp / Iris/Pupil HOM 5f:4m Fisher Exact Test framework 0.182 Success
Dbn1tm1a(KOMP)Wtsi WTSI Slit Lamp / Iris/Pupil HET 7f:8m Fisher Exact Test framework 0.283 Success
Dbn1tm1a(KOMP)Wtsi WTSI Slit Lamp / Iris/Pupil HET 7f:8m Fisher Exact Test framework 0.283 Success
Dbn1tm1a(KOMP)Wtsi WTSI Slit Lamp / lens opacity HOM 5f:4m Fisher Exact Test framework 0.0284 Success
Dbn1tm1a(KOMP)Wtsi WTSI Slit Lamp / lens opacity HOM 5f:4m Fisher Exact Test framework 0.0284 Success
Dbn1tm1a(KOMP)Wtsi WTSI Slit Lamp / lens opacity HET 7f:8m Fisher Exact Test framework 0.240 Success
Dbn1tm1a(KOMP)Wtsi WTSI Slit Lamp / lens opacity HET 7f:8m Fisher Exact Test framework 0.240 Success
Dbn1tm1b(KOMP)Wtsi JAX Electroretinography / Rod b-wave implicit time HET 2f:1m Not processed 1.00 FAILED - Not enough mutant or control data
Dbn1tm1a(KOMP)Wtsi WTSI Slit Lamp / Iris/Pupil shape HOM 5f:4m Fisher Exact Test framework 0.0255 Success
Dbn1tm1a(KOMP)Wtsi WTSI Slit Lamp / Iris/Pupil shape HOM 5f:4m Fisher Exact Test framework 0.0255 Success
Dbn1tm1a(KOMP)Wtsi WTSI Slit Lamp / Iris/Pupil shape HET 7f:8m Fisher Exact Test framework 0.183 Success
Dbn1tm1a(KOMP)Wtsi WTSI Slit Lamp / Iris/Pupil shape HET 7f:8m Fisher Exact Test framework 0.183 Success
Dbn1tm1a(KOMP)Wtsi WTSI Slit Lamp / Iris/Pupil position HET 7f:8m Fisher Exact Test framework 0.126 Success
Dbn1tm1a(KOMP)Wtsi WTSI Slit Lamp / Iris/Pupil position HET 7f:8m Fisher Exact Test framework 0.126 Success
Dbn1tm1a(KOMP)Wtsi WTSI Slit Lamp / Iris/Pupil position HOM 5f:4m Fisher Exact Test framework 1.00 Success
Dbn1tm1a(KOMP)Wtsi WTSI Slit Lamp / Iris/Pupil position HOM 5f:4m Fisher Exact Test framework 1.00 Success
Dbn1tm1a(KOMP)Wtsi WTSI Slit Lamp / Iris pigment HET 7f:8m Fisher Exact Test framework 1.00 Not tested (No variation) - OK
Dbn1tm1a(KOMP)Wtsi WTSI Slit Lamp / Iris pigment HOM 5f:4m Fisher Exact Test framework 1.00 Not tested (No variation) - OK
Dbn1tm1a(KOMP)Wtsi WTSI Slit Lamp / Iris pigment HET 7f:8m Fisher Exact Test framework 1.00 Not tested (No variation) - OK
Dbn1tm1a(KOMP)Wtsi WTSI Slit Lamp / Iris pigment HOM 5f:4m Fisher Exact Test framework 1.00 Not tested (No variation) - OK
Dbn1tm1a(KOMP)Wtsi WTSI Slit Lamp / Iris/Pupil light response HET 7f:8m Fisher Exact Test framework 0.0534 Success
Dbn1tm1a(KOMP)Wtsi WTSI Slit Lamp / Iris/Pupil light response HET 7f:8m Fisher Exact Test framework 0.0534 Success
Dbn1tm1a(KOMP)Wtsi WTSI Slit Lamp / Iris/Pupil light response HOM 5f:4m Fisher Exact Test framework 1.00 Success
Dbn1tm1a(KOMP)Wtsi WTSI Slit Lamp / Iris/Pupil light response HOM 5f:4m Fisher Exact Test framework 1.00 Success
Dbn1tm1b(KOMP)Wtsi ICS Eye Morphology / Right outer nuclear layer HET 8f:8m Mixed Model framework, linear mixed-effects model, equation withoutWeight 0.583 Success
Dbn1tm1b(KOMP)Wtsi BCM Eye Morphology / Right outer nuclear layer HOM 1f:1m Not processed 1.00 FAILED - Not enough mutant or control data
Dbn1tm1a(KOMP)Wtsi WTSI Eye Morphology / Right outer nuclear layer HOM 3f:1m Not processed 1.00 FAILED - Not enough mutant or control data
Dbn1tm1b(KOMP)Wtsi HMGU Eye Morphology / Iris transilumination HET 10f:10m Fisher Exact Test framework 1.00 Not tested (No variation) - OK
Dbn1tm1a(KOMP)Wtsi WTSI Eye Morphology / Iris transilumination HOM 3f:1m - 1.00 FAILED - Not enough mutant or control data
Dbn1tm1b(KOMP)Wtsi BCM Eye Morphology / Iris transilumination HOM 1f:1m - 1.00 FAILED - Not enough mutant or control data
Dbn1tm1b(KOMP)Wtsi JAX Eye Morphology / Iris transilumination HET 7f:9m Fisher Exact Test framework 1.00 Success
Dbn1tm1b(KOMP)Wtsi ICS Eye Morphology / Iris transilumination HET 8f:8m Fisher Exact Test framework 1.00 Not tested (No variation) - OK
Dbn1tm1b(KOMP)Wtsi JAX Electroretinography / Cone b-wave amplitude-left HET 2f:1m Not processed 1.00 FAILED - Not enough mutant or control data
Dbn1tm1a(KOMP)Wtsi WTSI Modified SHIRPA / Palpebral Closure HOM 4f:4m Fisher Exact Test framework 1.00 Not tested (No variation) - OK
Dbn1tm1a(KOMP)Wtsi WTSI Modified SHIRPA / Palpebral Closure HET 4f:5m Fisher Exact Test framework 1.00 Not tested (No variation) - OK
Dbn1tm1a(KOMP)Wtsi WTSI Modified SHIRPA / Palpebral Closure HET 4f:5m Fisher Exact Test framework 1.00 Not tested (No variation) - OK
Dbn1tm1a(KOMP)Wtsi WTSI Modified SHIRPA / Palpebral Closure HOM 4f:4m Fisher Exact Test framework 1.00 Not tested (No variation) - OK
Dbn1tm1a(KOMP)Wtsi WTSI Modified SHIRPA / Lacrimation HET 4f:5m Fisher Exact Test framework 1.00 Success
Dbn1tm1a(KOMP)Wtsi WTSI Modified SHIRPA / Lacrimation HOM 4f:4m Fisher Exact Test framework 1.00 Success
Dbn1tm1a(KOMP)Wtsi WTSI Modified SHIRPA / Lacrimation HOM 4f:4m Fisher Exact Test framework 1.00 Success
Dbn1tm1a(KOMP)Wtsi WTSI Modified SHIRPA / Lacrimation HET 4f:5m Fisher Exact Test framework 1.00 Success
Dbn1tm1a(KOMP)Wtsi WTSI Ophthalmoscope / Left Retina Structure HET 7f:8m Fisher Exact Test framework 1.00 Not tested (No variation) - OK
Dbn1tm1a(KOMP)Wtsi WTSI Ophthalmoscope / Left Retina Structure HOM 5f:4m Fisher Exact Test framework 1.00 Not tested (No variation) - OK
Dbn1tm1a(KOMP)Wtsi WTSI Ophthalmoscope / Left Retina Structure HET 7f:8m Fisher Exact Test framework 1.00 Not tested (No variation) - OK
Dbn1tm1a(KOMP)Wtsi WTSI Ophthalmoscope / Left Retina Structure HOM 5f:4m Fisher Exact Test framework 1.00 Not tested (No variation) - OK
Dbn1tm1a(KOMP)Wtsi WTSI Ophthalmoscope / Left Retina Pigmentation HET 7f:8m Fisher Exact Test framework 0.245 Success
Dbn1tm1a(KOMP)Wtsi WTSI Ophthalmoscope / Left Retina Pigmentation HET 7f:8m Fisher Exact Test framework 0.245 Success
Dbn1tm1a(KOMP)Wtsi WTSI Ophthalmoscope / Left Retina Pigmentation HOM 5f:4m Fisher Exact Test framework 1.00 Success
Dbn1tm1a(KOMP)Wtsi WTSI Ophthalmoscope / Left Retina Pigmentation HOM 5f:4m Fisher Exact Test framework 1.00 Success
Dbn1em2(IMPC)Mbp UC Davis Gross Morphology Embryo E9.5 / Optic vesicle morphology HOM f:m Supplied as data Success
Dbn1em2(IMPC)Mbp UC Davis Gross Morphology Embryo E9.5 / Optic vesicle morphology HET f:m Supplied as data Success
Dbn1em2(IMPC)Mbp UC Davis Gross Morphology Embryo E9.5 / Optic vesicle morphology HOM f:m Supplied as data Success
Dbn1em2(IMPC)Mbp UC Davis Gross Morphology Embryo E9.5 / Optic vesicle morphology HET f:m Supplied as data Success
Dbn1tm1a(KOMP)Wtsi WTSI Ophthalmoscope / Right Retina HOM 5f:4m Fisher Exact Test framework 0.620 Success
Dbn1tm1a(KOMP)Wtsi WTSI Ophthalmoscope / Right Retina HOM 5f:4m Fisher Exact Test framework 0.620 Success
Dbn1tm1a(KOMP)Wtsi WTSI Ophthalmoscope / Right Retina HET 5f:8m Fisher Exact Test framework 1.00 Success
Dbn1tm1a(KOMP)Wtsi WTSI Ophthalmoscope / Right Retina HET 5f:8m Fisher Exact Test framework 1.00 Success
Dbn1tm1a(KOMP)Wtsi WTSI Ophthalmoscope / Left Optic Disc HOM 5f:4m Fisher Exact Test framework 1.00 Not tested (No variation) - OK
Dbn1tm1a(KOMP)Wtsi WTSI Ophthalmoscope / Left Optic Disc HET 7f:8m Fisher Exact Test framework 1.00 Not tested (No variation) - OK
Dbn1tm1a(KOMP)Wtsi WTSI Ophthalmoscope / Left Optic Disc HOM 5f:4m Fisher Exact Test framework 1.00 Not tested (No variation) - OK
Dbn1tm1a(KOMP)Wtsi WTSI Ophthalmoscope / Left Optic Disc HET 7f:8m Fisher Exact Test framework 1.00 Not tested (No variation) - OK
Dbn1tm1a(KOMP)Wtsi WTSI Ophthalmoscope / Eye HET 7f:8m Fisher Exact Test framework 1.00 Success
Dbn1tm1a(KOMP)Wtsi WTSI Ophthalmoscope / Eye HOM 5f:4m Fisher Exact Test framework 1.00 Success
Dbn1tm1a(KOMP)Wtsi WTSI Ophthalmoscope / Eye HOM 5f:4m Fisher Exact Test framework 1.00 Success
Dbn1tm1a(KOMP)Wtsi WTSI Ophthalmoscope / Eye HET 7f:8m Fisher Exact Test framework 1.00 Success
Dbn1tm1b(KOMP)Wtsi JAX Electroretinography / Rod b-wave amplitude-left HET 2f:1m Not processed 1.00 FAILED - Not enough mutant or control data
Dbn1tm1b(KOMP)Wtsi JAX Electroretinography / Cone b-wave amplitude-right HET 2f:1m Not processed 1.00 FAILED - Not enough mutant or control data
Dbn1tm1b(KOMP)Wtsi HMGU Eye Morphology / Mean right eye lens density HET 9f:10m Mixed Model framework, linear mixed-effects model, equation withWeight 0.209 Success
Dbn1tm1b(KOMP)Wtsi BCM Eye Morphology / Mean right eye lens density HOM 1f:1m Not processed 1.00 FAILED - Not enough mutant or control data
Dbn1tm1a(KOMP)Wtsi WTSI Eye Morphology / Mean right eye lens density HOM 3f:1m Not processed 1.00 FAILED - Not enough mutant or control data
Dbn1tm1a(KOMP)Wtsi WTSI Ophthalmoscope / Left Retina HET 7f:8m Fisher Exact Test framework 0.246 Success
Dbn1tm1a(KOMP)Wtsi WTSI Ophthalmoscope / Left Retina HET 7f:8m Fisher Exact Test framework 0.246 Success
Dbn1tm1a(KOMP)Wtsi WTSI Ophthalmoscope / Left Retina HOM 5f:4m Fisher Exact Test framework 1.00 Success
Dbn1tm1a(KOMP)Wtsi WTSI Ophthalmoscope / Left Retina HOM 5f:4m Fisher Exact Test framework 1.00 Success
Dbn1tm1b(KOMP)Wtsi ICS Eye Morphology / Vitreous HET 8f:8m Fisher Exact Test framework 0.434 Success
Dbn1tm1b(KOMP)Wtsi BCM Eye Morphology / Vitreous HOM 1f:1m - 1.00 FAILED - Not enough mutant or control data
Dbn1tm1b(KOMP)Wtsi KMPC Eye Morphology / Vitreous HET 8f:7m Fisher Exact Test framework 1.00 Not tested (No variation) - OK
Dbn1tm1b(KOMP)Wtsi JAX Eye Morphology / Vitreous HET 7f:9m Fisher Exact Test framework 1.00 Success
Dbn1tm1a(KOMP)Wtsi WTSI Eye Morphology / Vitreous HOM 3f:1m - 1.00 FAILED - Not enough mutant or control data
Dbn1tm1b(KOMP)Wtsi RBRC Eye Morphology / Vitreous HET 7f:7m Fisher Exact Test framework 1.00 Not tested (No variation) - OK
Dbn1tm1b(KOMP)Wtsi ICS Eye Morphology / Lens HET 7f:8m Fisher Exact Test framework 0.0189 Success
Dbn1em1(IMPC)Bay BCM Eye Morphology / Lens HOM 7f:7m Fisher Exact Test framework 0.168 Success
Dbn1tm1b(KOMP)Wtsi JAX Eye Morphology / Lens HET 7f:9m Fisher Exact Test framework 0.593 Success
Dbn1tm1b(KOMP)Wtsi TCP Eye Morphology / Lens HET 8f:8m Fisher Exact Test framework 1.00 Success
Dbn1tm1b(KOMP)Wtsi HMGU Eye Morphology / Lens HET 10f:10m Fisher Exact Test framework 1.00 Success
Dbn1tm1b(KOMP)Wtsi BCM Eye Morphology / Lens HOM 1f:1m - 1.00 FAILED - Not enough mutant or control data
Dbn1tm1b(KOMP)Wtsi KMPC Eye Morphology / Lens HET 8f:7m Fisher Exact Test framework 1.00 Success
Dbn1tm1b(KOMP)Wtsi BCM Eye Morphology / Lens HET 8f:5m Fisher Exact Test framework 1.00 Success
Dbn1tm1b(KOMP)Wtsi WTSI Eye Morphology / Lens HET 7f:7m Fisher Exact Test framework 1.00 Success
Dbn1tm1a(KOMP)Wtsi WTSI Eye Morphology / Lens HOM 3f:1m - 1.00 FAILED - Not enough mutant or control data
Dbn1tm1a(KOMP)Wtsi WTSI Eye Morphology / Lens HET 7f:7m Fisher Exact Test framework 1.00 Success
Dbn1tm1b(KOMP)Wtsi RBRC Eye Morphology / Lens HET 7f:7m Fisher Exact Test framework 1.00 Not tested (No variation) - OK
Dbn1tm1a(KOMP)Wtsi WTSI Ophthalmoscope / Right Retina Structure HET 5f:8m Fisher Exact Test framework 1.00 Success
Dbn1tm1a(KOMP)Wtsi WTSI Ophthalmoscope / Right Retina Structure HOM 5f:4m Fisher Exact Test framework 1.00 Success
Dbn1tm1a(KOMP)Wtsi WTSI Ophthalmoscope / Right Retina Structure HOM 5f:4m Fisher Exact Test framework 1.00 Success
Dbn1tm1a(KOMP)Wtsi WTSI Ophthalmoscope / Right Retina Structure HET 5f:8m Fisher Exact Test framework 1.00 Success
Dbn1tm1a(KOMP)Wtsi WTSI Ophthalmoscope / Right Retina Pigmentation HOM 5f:4m Fisher Exact Test framework 0.621 Success
Dbn1tm1a(KOMP)Wtsi WTSI Ophthalmoscope / Right Retina Pigmentation HOM 5f:4m Fisher Exact Test framework 0.621 Success
Dbn1tm1a(KOMP)Wtsi WTSI Ophthalmoscope / Right Retina Pigmentation HET 5f:8m Fisher Exact Test framework 1.00 Success
Dbn1tm1a(KOMP)Wtsi WTSI Ophthalmoscope / Right Retina Pigmentation HET 5f:8m Fisher Exact Test framework 1.00 Success
Dbn1tm1b(KOMP)Wtsi BCM Eye Morphology / Left corneal thickness HOM 1f:1m Not processed 1.00 FAILED - Not enough mutant or control data
Dbn1tm1a(KOMP)Wtsi WTSI Eye Morphology / Left corneal thickness HOM 3f:1m Not processed 1.00 FAILED - Not enough mutant or control data
Dbn1tm1b(KOMP)Wtsi ICS Eye Morphology / Left corneal thickness HET 3f:8m Not processed 1.00 FAILED - Not enough data points in dependent variable 'IMPC_EYE_066_001' for genotype/sex combinations to allow the application of MM/TF framework. Threshold used: 4.
Dbn1tm1b(KOMP)Wtsi TCP Eye Morphology / Optic Disc HET 8f:8m Fisher Exact Test framework 0.127 Success
Dbn1tm1b(KOMP)Wtsi HMGU Eye Morphology / Optic Disc HET 10f:10m Fisher Exact Test framework 1.00 Success
Dbn1tm1a(KOMP)Wtsi WTSI Eye Morphology / Optic Disc HOM 3f:1m - 1.00 FAILED - Not enough mutant or control data
Dbn1tm1b(KOMP)Wtsi BCM Eye Morphology / Optic Disc HET 8f:5m Fisher Exact Test framework 1.00 Success
Dbn1tm1b(KOMP)Wtsi BCM Eye Morphology / Optic Disc HOM 1f:1m - 1.00 FAILED - Not enough mutant or control data
Dbn1tm1b(KOMP)Wtsi WTSI Eye Morphology / Optic Disc HET 7f:7m Fisher Exact Test framework 1.00 Success
Dbn1tm1b(KOMP)Wtsi KMPC Eye Morphology / Optic Disc HET 8f:7m Fisher Exact Test framework 1.00 Not tested (No variation) - OK
Dbn1em1(IMPC)Bay BCM Eye Morphology / Optic Disc HOM 7f:6m Fisher Exact Test framework 1.00 Success
Dbn1tm1a(KOMP)Wtsi WTSI Eye Morphology / Optic Disc HET 7f:7m Fisher Exact Test framework 1.00 Success
Dbn1tm1b(KOMP)Wtsi JAX Eye Morphology / Optic Disc HET 7f:9m Fisher Exact Test framework 1.00 Success
Dbn1tm1b(KOMP)Wtsi RBRC Eye Morphology / Optic Disc HET 7f:7m Fisher Exact Test framework 1.00 Success
Dbn1tm1b(KOMP)Wtsi ICS Eye Morphology / Optic Disc HET 8f:8m Fisher Exact Test framework 1.00 Success
Dbn1tm1b(KOMP)Wtsi KMPC Eye Morphology / Retinal Blood Vessels Structure HET 8f:7m Fisher Exact Test framework 0.0363 Success
Dbn1tm1b(KOMP)Wtsi TCP Eye Morphology / Retinal Blood Vessels Structure HET 8f:8m Fisher Exact Test framework 1.00 Success
Dbn1tm1b(KOMP)Wtsi HMGU Eye Morphology / Retinal Blood Vessels Structure HET 10f:10m Fisher Exact Test framework 1.00 Success
Dbn1tm1b(KOMP)Wtsi BCM Eye Morphology / Retinal Blood Vessels Structure HET 8f:5m Fisher Exact Test framework 1.00 Success
Dbn1tm1b(KOMP)Wtsi BCM Eye Morphology / Retinal Blood Vessels Structure HOM 1f:1m - 1.00 FAILED - Not enough mutant or control data
Dbn1tm1b(KOMP)Wtsi WTSI Eye Morphology / Retinal Blood Vessels Structure HET 7f:7m Fisher Exact Test framework 1.00 Success
Dbn1em1(IMPC)Bay BCM Eye Morphology / Retinal Blood Vessels Structure HOM 7f:7m Fisher Exact Test framework 1.00 Success
Dbn1tm1b(KOMP)Wtsi JAX Eye Morphology / Retinal Blood Vessels Structure HET 7f:9m Fisher Exact Test framework 1.00 Success
Dbn1tm1a(KOMP)Wtsi WTSI Eye Morphology / Retinal Blood Vessels Structure HOM 3f:1m - 1.00 FAILED - Not enough mutant or control data
Dbn1tm1a(KOMP)Wtsi WTSI Eye Morphology / Retinal Blood Vessels Structure HET 7f:7m Fisher Exact Test framework 1.00 Success
Dbn1tm1b(KOMP)Wtsi RBRC Eye Morphology / Retinal Blood Vessels Structure HET 7f:7m Fisher Exact Test framework 1.00 Success
Dbn1tm1b(KOMP)Wtsi ICS Eye Morphology / Retinal Blood Vessels Structure HET 8f:8m Fisher Exact Test framework 1.00 Success
Dbn1tm1b(KOMP)Wtsi TCP Eye Morphology / Narrow eye opening HET 8f:8m Fisher Exact Test framework 1.00 Success
Dbn1tm1b(KOMP)Wtsi HMGU Eye Morphology / Narrow eye opening HET 10f:10m Fisher Exact Test framework 1.00 Success
Dbn1tm1b(KOMP)Wtsi BCM Eye Morphology / Narrow eye opening HET 8f:5m Fisher Exact Test framework 1.00 Success
Dbn1tm1b(KOMP)Wtsi BCM Eye Morphology / Narrow eye opening HOM 1f:1m - 1.00 FAILED - Not enough mutant or control data
Dbn1tm1b(KOMP)Wtsi WTSI Eye Morphology / Narrow eye opening HET 7f:7m Fisher Exact Test framework 1.00 Success
Dbn1em1(IMPC)Bay BCM Eye Morphology / Narrow eye opening HOM 7f:7m Fisher Exact Test framework 1.00 Success
Dbn1tm1b(KOMP)Wtsi KMPC Eye Morphology / Narrow eye opening HET 8f:7m Fisher Exact Test framework 1.00 Not tested (No variation) - OK
Dbn1tm1a(KOMP)Wtsi WTSI Eye Morphology / Narrow eye opening HET 7f:7m Fisher Exact Test framework 1.00 Success
Dbn1tm1a(KOMP)Wtsi WTSI Eye Morphology / Narrow eye opening HOM 3f:1m - 1.00 FAILED - Not enough mutant or control data
Dbn1tm1b(KOMP)Wtsi JAX Eye Morphology / Narrow eye opening HET 7f:9m Fisher Exact Test framework 1.00 Success
Dbn1tm1b(KOMP)Wtsi RBRC Eye Morphology / Narrow eye opening HET 7f:7m Fisher Exact Test framework 1.00 Success
Dbn1tm1b(KOMP)Wtsi ICS Eye Morphology / Narrow eye opening HET 8f:8m Fisher Exact Test framework 1.00 Success
Dbn1tm1b(KOMP)Wtsi ICS Eye Morphology / Left total retinal thickness HET 7f:8m Mixed Model framework, linear mixed-effects model, equation withoutWeight 1.27×10-06 Success
Dbn1tm1b(KOMP)Wtsi HMGU Eye Morphology / Left total retinal thickness HET 10f:10m Mixed Model framework, linear mixed-effects model, equation withoutWeight 0.00978 Success
Dbn1tm1b(KOMP)Wtsi BCM Eye Morphology / Left total retinal thickness HOM 1f:1m Not processed 1.00 FAILED - Not enough mutant or control data
Dbn1tm1a(KOMP)Wtsi WTSI Eye Morphology / Left total retinal thickness HOM 3f:1m Not processed 1.00 FAILED - Not enough mutant or control data
Dbn1tm1b(KOMP)Wtsi KMPC Eye Morphology / Corneal ulcer HET 8f:7m Fisher Exact Test framework 0.0515 Success
Dbn1tm1b(KOMP)Wtsi BCM Eye Morphology / Corneal ulcer HOM 1f:1m - 1.00 FAILED - Not enough mutant or control data
Dbn1tm1a(KOMP)Wtsi WTSI Eye Morphology / Corneal ulcer HOM 3f:1m - 1.00 FAILED - Not enough mutant or control data
Dbn1tm1b(KOMP)Wtsi RBRC Eye Morphology / Corneal ulcer HET 7f:7m Fisher Exact Test framework 1.00 Not tested (No variation) - OK
Dbn1tm1b(KOMP)Wtsi ICS Eye Morphology / Corneal ulcer HET 8f:8m Fisher Exact Test framework 1.00 Success
Dbn1tm1a(KOMP)Wtsi WTSI Ophthalmoscope / Right Optic Disc HOM 5f:4m Fisher Exact Test framework 1.00 Not tested (No variation) - OK
Dbn1tm1a(KOMP)Wtsi WTSI Ophthalmoscope / Right Optic Disc HET 5f:8m Fisher Exact Test framework 1.00 Not tested (No variation) - OK
Dbn1tm1a(KOMP)Wtsi WTSI Ophthalmoscope / Right Optic Disc HET 5f:8m Fisher Exact Test framework 1.00 Not tested (No variation) - OK
Dbn1tm1a(KOMP)Wtsi WTSI Ophthalmoscope / Right Optic Disc HOM 5f:4m Fisher Exact Test framework 1.00 Not tested (No variation) - OK
Dbn1tm1b(KOMP)Wtsi UC Davis Gross Morphology Embryo E14.5-E15.5 / Anophthalmia HOM f:m Supplied as data Success
Dbn1tm1b(KOMP)Wtsi UC Davis Gross Morphology Embryo E14.5-E15.5 / Anophthalmia HET f:m Supplied as data Success
Dbn1tm1b(KOMP)Wtsi TCP Gross Morphology Embryo E14.5-E15.5 / Anophthalmia HET f:m Supplied as data Success
Dbn1tm1b(KOMP)Wtsi UC Davis Gross Morphology Embryo E14.5-E15.5 / Anophthalmia HOM f:m Supplied as data Success
Dbn1tm1b(KOMP)Wtsi UC Davis Gross Morphology Embryo E14.5-E15.5 / Anophthalmia HET f:m Supplied as data Success
Dbn1tm1b(KOMP)Wtsi JAX Gross Morphology Embryo E18.5 / Failure of Eyelid Fusion HOM f:m Supplied as data Success
Dbn1tm1b(KOMP)Wtsi JAX Gross Morphology Embryo E18.5 / Failure of Eyelid Fusion HET f:m Supplied as data Success
Dbn1tm1b(KOMP)Wtsi JAX Gross Morphology Embryo E18.5 / Failure of Eyelid Fusion HET f:m Supplied as data Success
Dbn1tm1b(KOMP)Wtsi JAX Gross Morphology Embryo E18.5 / Failure of Eyelid Fusion HOM f:m Supplied as data Success
Dbn1tm1b(KOMP)Wtsi BCM Gross Morphology Embryo E18.5 / Failure of Eyelid Fusion HET f:m Supplied as data Success
Dbn1tm1b(KOMP)Wtsi BCM Gross Morphology Embryo E18.5 / Failure of Eyelid Fusion HOM f:m Supplied as data Success
Dbn1tm1b(KOMP)Wtsi BCM Gross Morphology Embryo E18.5 / Failure of Eyelid Fusion HOM f:m Supplied as data Success
Dbn1tm1b(KOMP)Wtsi BCM Gross Morphology Embryo E18.5 / Failure of Eyelid Fusion HET f:m Supplied as data Success
Dbn1tm1b(KOMP)Wtsi JAX Electroretinography / Rod a-wave implicit time HET 2f:1m Not processed 1.00 FAILED - Not enough mutant or control data
Dbn1tm1a(KOMP)Wtsi WTSI Ophthalmoscope / Right Eye Blood Vessels Pattern HET 5f:8m Fisher Exact Test framework 1.00 Success
Dbn1tm1a(KOMP)Wtsi WTSI Ophthalmoscope / Right Eye Blood Vessels Pattern HOM 5f:4m Fisher Exact Test framework 1.00 Success
Dbn1tm1a(KOMP)Wtsi WTSI Ophthalmoscope / Right Eye Blood Vessels Pattern HET 5f:8m Fisher Exact Test framework 1.00 Success
Dbn1tm1a(KOMP)Wtsi WTSI Ophthalmoscope / Right Eye Blood Vessels Pattern HOM 5f:4m Fisher Exact Test framework 1.00 Success
Dbn1tm1a(KOMP)Wtsi WTSI Ophthalmoscope / Left Eye Blood Vessels HET 7f:8m Fisher Exact Test framework 0.0537 Success
Dbn1tm1a(KOMP)Wtsi WTSI Ophthalmoscope / Left Eye Blood Vessels HET 7f:8m Fisher Exact Test framework 0.0537 Success
Dbn1tm1a(KOMP)Wtsi WTSI Ophthalmoscope / Left Eye Blood Vessels HOM 5f:4m Fisher Exact Test framework 1.00 Success
Dbn1tm1a(KOMP)Wtsi WTSI Ophthalmoscope / Left Eye Blood Vessels HOM 5f:4m Fisher Exact Test framework 1.00 Success
Dbn1tm1a(KOMP)Wtsi WTSI Ophthalmoscope / Right Eye Blood Vessels HET 5f:8m Fisher Exact Test framework 1.00 Success
Dbn1tm1a(KOMP)Wtsi WTSI Ophthalmoscope / Right Eye Blood Vessels HOM 5f:4m Fisher Exact Test framework 1.00 Success
Dbn1tm1a(KOMP)Wtsi WTSI Ophthalmoscope / Right Eye Blood Vessels HET 5f:8m Fisher Exact Test framework 1.00 Success
Dbn1tm1a(KOMP)Wtsi WTSI Ophthalmoscope / Right Eye Blood Vessels HOM 5f:4m Fisher Exact Test framework 1.00 Success
Dbn1tm1a(KOMP)Wtsi WTSI Ophthalmoscope / Left Eye Blood Vessels Pattern HET 7f:8m Fisher Exact Test framework 1.00 Success
Dbn1tm1a(KOMP)Wtsi WTSI Ophthalmoscope / Left Eye Blood Vessels Pattern HOM 5f:4m Fisher Exact Test framework 1.00 Success
Dbn1tm1a(KOMP)Wtsi WTSI Ophthalmoscope / Left Eye Blood Vessels Pattern HET 7f:8m Fisher Exact Test framework 1.00 Success
Dbn1tm1a(KOMP)Wtsi WTSI Ophthalmoscope / Left Eye Blood Vessels Pattern HOM 5f:4m Fisher Exact Test framework 1.00 Success
Dbn1tm1b(KOMP)Wtsi JAX Electroretinography / Rod a-wave amplitude HET 2f:1m Not processed 1.00 FAILED - Not enough mutant or control data
Dbn1tm1b(KOMP)Wtsi HMGU Eye Morphology / Persistence of hyaloid vascular system HET 10f:10m Fisher Exact Test framework 0.00630 Success
Dbn1tm1b(KOMP)Wtsi RBRC Eye Morphology / Persistence of hyaloid vascular system HET 7f:7m Fisher Exact Test framework 0.00991 Success
Dbn1tm1b(KOMP)Wtsi BCM Eye Morphology / Persistence of hyaloid vascular system HET 8f:5m Fisher Exact Test framework 0.0286 Success
Dbn1tm1b(KOMP)Wtsi ICS Eye Morphology / Persistence of hyaloid vascular system HET 8f:8m Fisher Exact Test framework 0.373 Success
Dbn1em1(IMPC)Bay BCM Eye Morphology / Persistence of hyaloid vascular system HOM 7f:7m Fisher Exact Test framework 0.827 Success
Dbn1tm1b(KOMP)Wtsi TCP Eye Morphology / Persistence of hyaloid vascular system HET 8f:8m Fisher Exact Test framework 1.00 Success
Dbn1tm1a(KOMP)Wtsi WTSI Eye Morphology / Persistence of hyaloid vascular system HOM 3f:1m - 1.00 FAILED - Not enough mutant or control data
Dbn1tm1b(KOMP)Wtsi WTSI Eye Morphology / Persistence of hyaloid vascular system HET 7f:7m Fisher Exact Test framework 1.00 Success
Dbn1tm1b(KOMP)Wtsi KMPC Eye Morphology / Persistence of hyaloid vascular system HET 8f:7m Fisher Exact Test framework 1.00 Not tested (No variation) - OK
Dbn1tm1b(KOMP)Wtsi BCM Eye Morphology / Persistence of hyaloid vascular system HOM 1f:1m - 1.00 FAILED - Not enough mutant or control data
Dbn1tm1a(KOMP)Wtsi WTSI Eye Morphology / Persistence of hyaloid vascular system HET 7f:7m Fisher Exact Test framework 1.00 Success
Dbn1tm1b(KOMP)Wtsi JAX Eye Morphology / Persistence of hyaloid vascular system HET 7f:9m Fisher Exact Test framework 1.00 Success
Dbn1tm1b(KOMP)Wtsi TCP Eye Morphology / Pupil Shape HET 8f:8m Fisher Exact Test framework 1.00 Success
Dbn1tm1b(KOMP)Wtsi HMGU Eye Morphology / Pupil Shape HET 10f:10m Fisher Exact Test framework 1.00 Success
Dbn1tm1b(KOMP)Wtsi BCM Eye Morphology / Pupil Shape HET 8f:5m Fisher Exact Test framework 1.00 Success
Dbn1tm1b(KOMP)Wtsi KMPC Eye Morphology / Pupil Shape HET 8f:7m Fisher Exact Test framework 1.00 Not tested (No variation) - OK
Dbn1em1(IMPC)Bay BCM Eye Morphology / Pupil Shape HOM 7f:7m Fisher Exact Test framework 1.00 Success
Dbn1tm1b(KOMP)Wtsi BCM Eye Morphology / Pupil Shape HOM 1f:1m - 1.00 FAILED - Not enough mutant or control data
Dbn1tm1b(KOMP)Wtsi WTSI Eye Morphology / Pupil Shape HET 7f:7m Fisher Exact Test framework 1.00 Success
Dbn1tm1a(KOMP)Wtsi WTSI Eye Morphology / Pupil Shape HET 7f:7m Fisher Exact Test framework 1.00 Success
Dbn1tm1a(KOMP)Wtsi WTSI Eye Morphology / Pupil Shape HOM 3f:1m - 1.00 FAILED - Not enough mutant or control data
Dbn1tm1b(KOMP)Wtsi JAX Eye Morphology / Pupil Shape HET 7f:9m Fisher Exact Test framework 1.00 Success
Dbn1tm1b(KOMP)Wtsi RBRC Eye Morphology / Pupil Shape HET 7f:7m Fisher Exact Test framework 1.00 Success
Dbn1tm1b(KOMP)Wtsi ICS Eye Morphology / Pupil Shape HET 8f:8m Fisher Exact Test framework 1.00 Success
Dbn1tm1b(KOMP)Wtsi TCP Eye Morphology / Eye HET 8f:8m Fisher Exact Test framework 1.00 Success
Dbn1tm1b(KOMP)Wtsi HMGU Eye Morphology / Eye HET 10f:10m Fisher Exact Test framework 1.00 Success
Dbn1tm1b(KOMP)Wtsi RBRC Eye Morphology / Eye HET 7f:7m Fisher Exact Test framework 1.00 Not tested (No variation) - OK
Dbn1tm1b(KOMP)Wtsi BCM Eye Morphology / Eye HET 8f:5m Fisher Exact Test framework 1.00 Success
Dbn1tm1b(KOMP)Wtsi BCM Eye Morphology / Eye HOM 1f:1m - 1.00 FAILED - Not enough mutant or control data
Dbn1em1(IMPC)Bay BCM Eye Morphology / Eye HOM 7f:7m Fisher Exact Test framework 1.00 Not tested (No variation) - OK
Dbn1tm1b(KOMP)Wtsi KMPC Eye Morphology / Eye HET 8f:7m Fisher Exact Test framework 1.00 Not tested (No variation) - OK
Dbn1tm1a(KOMP)Wtsi WTSI Eye Morphology / Eye HOM 3f:1m - 1.00 FAILED - Not enough mutant or control data
Dbn1tm1b(KOMP)Wtsi JAX Eye Morphology / Eye HET 7f:9m Fisher Exact Test framework 1.00 Success
Dbn1tm1b(KOMP)Wtsi ICS Eye Morphology / Eye HET 8f:8m Fisher Exact Test framework 1.00 Success
Dbn1tm1b(KOMP)Wtsi ICS Eye Morphology / Right vitreous humor thickness HET 8f:8m Mixed Model framework, generalized least squares, equation withoutWeight 0.449 Success
Dbn1tm1b(KOMP)Wtsi BCM Eye Morphology / Right vitreous humor thickness HOM 1f:1m Not processed 1.00 FAILED - Not enough mutant or control data
Dbn1tm1a(KOMP)Wtsi WTSI Eye Morphology / Right vitreous humor thickness HOM 3f:1m Not processed 1.00 FAILED - Not enough mutant or control data
Dbn1tm1b(KOMP)Wtsi TCP Eye Morphology / Pupil Light Response HET 8f:8m Fisher Exact Test framework 1.00 Not tested (No variation) - OK
Dbn1tm1b(KOMP)Wtsi HMGU Eye Morphology / Pupil Light Response HET 10f:10m Fisher Exact Test framework 1.00 Success
Dbn1tm1a(KOMP)Wtsi WTSI Eye Morphology / Pupil Light Response HOM 3f:1m - 1.00 FAILED - Not enough mutant or control data
Dbn1tm1b(KOMP)Wtsi RBRC Eye Morphology / Pupil Light Response HET 7f:7m Fisher Exact Test framework 1.00 Success
Dbn1tm1b(KOMP)Wtsi WTSI Eye Morphology / Pupil Light Response HET 7f:7m Fisher Exact Test framework 1.00 Success
Dbn1tm1b(KOMP)Wtsi BCM Eye Morphology / Pupil Light Response HOM 1f:1m - 1.00 FAILED - Not enough mutant or control data
Dbn1tm1b(KOMP)Wtsi KMPC Eye Morphology / Pupil Light Response HET 8f:7m Fisher Exact Test framework 1.00 Not tested (No variation) - OK
Dbn1tm1a(KOMP)Wtsi WTSI Eye Morphology / Pupil Light Response HET 7f:7m Fisher Exact Test framework 1.00 Success
Dbn1tm1b(KOMP)Wtsi JAX Eye Morphology / Pupil Light Response HET 7f:9m Fisher Exact Test framework 1.00 Success
Dbn1tm1b(KOMP)Wtsi ICS Eye Morphology / Pupil Light Response HET 8f:8m Fisher Exact Test framework 1.00 Success
Dbn1em1(IMPC)Bay BCM Eye Morphology / Corneal opacity HOM 7f:7m Fisher Exact Test framework 0.304 Success
Dbn1tm1b(KOMP)Wtsi KMPC Eye Morphology / Corneal opacity HET 8f:7m Fisher Exact Test framework 0.325 Success
Dbn1tm1b(KOMP)Wtsi ICS Eye Morphology / Corneal opacity HET 8f:8m Fisher Exact Test framework 0.926 Success
Dbn1tm1b(KOMP)Wtsi TCP Eye Morphology / Corneal opacity HET 8f:8m Fisher Exact Test framework 1.00 Success
Dbn1tm1b(KOMP)Wtsi HMGU Eye Morphology / Corneal opacity HET 10f:10m Fisher Exact Test framework 1.00 Success
Dbn1tm1b(KOMP)Wtsi RBRC Eye Morphology / Corneal opacity HET 7f:7m Fisher Exact Test framework 1.00 Success
Dbn1tm1b(KOMP)Wtsi BCM Eye Morphology / Corneal opacity HOM 1f:1m - 1.00 FAILED - Not enough mutant or control data
Dbn1tm1b(KOMP)Wtsi BCM Eye Morphology / Corneal opacity HET 8f:5m Fisher Exact Test framework 1.00 Success
Dbn1tm1b(KOMP)Wtsi WTSI Eye Morphology / Corneal opacity HET 7f:7m Fisher Exact Test framework 1.00 Success
Dbn1tm1a(KOMP)Wtsi WTSI Eye Morphology / Corneal opacity HET 7f:7m Fisher Exact Test framework 1.00 Success
Dbn1tm1a(KOMP)Wtsi WTSI Eye Morphology / Corneal opacity HOM 3f:1m - 1.00 FAILED - Not enough mutant or control data
Dbn1tm1b(KOMP)Wtsi JAX Eye Morphology / Corneal opacity HET 7f:9m Fisher Exact Test framework 1.00 Success
Dbn1tm1b(KOMP)Wtsi HMGU Eye Morphology / Min right eye lens density HET 9f:10m Mixed Model framework, linear mixed-effects model, equation withWeight 0.825 Success
Dbn1tm1b(KOMP)Wtsi BCM Eye Morphology / Min right eye lens density HOM 1f:1m Not processed 1.00 FAILED - Not enough mutant or control data
Dbn1tm1a(KOMP)Wtsi WTSI Eye Morphology / Min right eye lens density HOM 3f:1m Not processed 1.00 FAILED - Not enough mutant or control data
Dbn1tm1b(KOMP)Wtsi ICS Eye Morphology / Right anterior chamber depth HET 6f:5m Mixed Model framework, linear mixed-effects model, equation withWeight 0.841 Success
Dbn1tm1b(KOMP)Wtsi BCM Eye Morphology / Right anterior chamber depth HOM 1f:1m Not processed 1.00 FAILED - Not enough mutant or control data
Dbn1tm1a(KOMP)Wtsi WTSI Eye Morphology / Right anterior chamber depth HOM 3f:1m Not processed 1.00 FAILED - Not enough mutant or control data
Dbn1tm1b(KOMP)Wtsi JAX Electroretinography / Rod a-wave amplitude-left HET 2f:1m Not processed 1.00 FAILED - Not enough mutant or control data

Download data as: TSV XLS

The IMPC Newsletter

Get highlights of the most important data releases, news and events, delivered straight to your email inbox

Subscribe to newsletter